Benzenamine, N-[(4-nitrophenyl)methylene]-
- Formula: C13H10N2O2
- Molecular weight: 226.2307
- IUPAC Standard InChIKey: GKSAMSVGROLNRA-UHFFFAOYSA-N
- CAS Registry Number: 785-80-8
- Chemical structure:
View 3d structure (requires JavaScript / HTML 5) - Other names: Aniline, N-(p-nitrobenzylidene)-; (p-Nitrobenzylidene)aniline; p-Nitrobenzaldehyde anil; N-(p-Nitrobenzylidene)aniline; 4-Nitrobenzalaniline; 4-Nitrobenzylideneaniline; N-phenyl 4-nitrobenzaldehyde imine

Phase change data

Data compiled by: William E. Acree, Jr., James S. Chickos
Quantity | Value | Units | Method | Reference | Comment |
---|---|---|---|---|---|
ΔsubH° | 30.1 ± 0.31 | kcal/mol | N/A | Verevkin, Morgenthaler, et al., 1997 |
Enthalpy of fusion
ΔfusH (kcal/mol) | Temperature (K) | Reference |
---|---|---|
5.870 | 347.2 | Verevkin, Morgenthaler, et al., 1997 |

References

Verevkin, Morgenthaler, et al., 1997
Verevkin, Sergey P.; Morgenthaler, Jens; Rüchardt, Christoph,
Thermochemistry of imines: experimental standard molar enthalpies of formation,
The Journal of Chemical Thermodynamics, 1997, 29, 10, 1175-1183, https://doi.org/10.1006/jcht.1997.0242
. [all data]