Methanone, (2-amino-5-chlorophenyl)(2-fluorophenyl)-
- Formula: C13H9ClFNO
- Molecular weight: 249.668
- IUPAC Standard InChIKey: GTGMXPIQRQSORU-UHFFFAOYSA-N
- CAS Registry Number: 784-38-3
- Chemical structure:
View 3d structure (requires JavaScript / HTML 5) - Other names: 2-Amino-2'-fluoro-5-chlorobenzophenone; 2-Amino-5-chloro-2'-fluorobenzophenone; Benzophenone, 2-amino-5-chloro-2'-fluoro-; 2-amino-5-chlor-2'-fluor-benzophenone

Kovats' RI, non-polar column, isothermal

Column type | Active phase | Temperature (C) | I | Reference | Comment |
---|---|---|---|---|---|
Capillary | HP-1 | 200. | 2004. | Weston, Japp, et al., 1991 | 30. m/0.53 mm/0.88 μm, N2 |
Packed | SE-30 | 220. | 2047. | Schütz, 1982 | N2 |

Normal alkane RI, non-polar column, custom temperature program

Column type | Active phase | I | Reference | Comment |
---|---|---|---|---|
Other | Methyl Silicone | 2045. | Ardrey and Moffat, 1981 | Program: not specified |

References

Weston, Japp, et al., 1991
Weston, S.I.; Japp, M.; Partridge, J.; Osselton, M.D.,
Collection of analytical data for benzodiazepines and benzophenones. Appendix,
J. Chromatogr., 1991, 538, 2, 277-284, https://doi.org/10.1016/S0021-9673(01)88848-8
. [all data]
Schütz, 1982
Schütz, H.,
Benzodiazepines, Springer-Verlag, New York, 1982, 438. [all data]
Ardrey and Moffat, 1981
Ardrey, R.E.; Moffat, A.C.,
Gas-liquid chromatographic retention indices of 1318 substances of toxicological interest on SE-30 or OV-1 stationary phase,
J. Chromatogr., 1981, 220, 3, 195-252, https://doi.org/10.1016/S0021-9673(00)81925-1
. [all data]