CAS Reg. No. 78413-15-7
- CAS Registry Number: 78413-15-7

Reaction thermochemistry data

Data compiled by: John E. Bartmess
Individual Reactions
(CAS Reg. No. 78413-15-7 • 4294967295) +
= CAS Reg. No. 78413-15-7
By formula: (CAS Reg. No. 78413-15-7 • 4294967295Ge) + Ge = CAS Reg. No. 78413-15-7
Quantity | Value | Units | Method | Reference | Comment |
---|---|---|---|---|---|
ΔrH° | 80.1 ± 1.4 | kcal/mol | N/A | Burton, Xu, et al., 1996 | gas phase |

References

Burton, Xu, et al., 1996
Burton, G.R.; Xu, C.; Arnold, C.C.; Neumark, D.M.,
Photoelectron Spectroscopy and Zero Kinetic Energy Spectroscopy of Germanium Cluster Anions,
J. Chem. Phys., 1996, 104, 8, 2757, https://doi.org/10.1063/1.471098
. [all data]