Ethanone, 1-(9-anthracenyl)-
- Formula: C16H12O
- Molecular weight: 220.2659
- IUPAC Standard InChIKey: NXXNVJDXUHMAHU-UHFFFAOYSA-N
- CAS Registry Number: 784-04-3
- Chemical structure:
View 3d structure (requires JavaScript / HTML 5) - Other names: 9-Acetoanthracene; 9-Acetylanthracene; Ketone, 9-anthryl methyl; 9-anthryl methyl ketone

Gas phase ion energetics data

Data compiled by: John E. Bartmess
Electron affinity determinations
EA (eV) | Method | Reference | Comment |
---|---|---|---|
1.02 ± 0.10 | IMRE | Heinis, Chowdhury, et al., 1993 | ΔGea(423 K)= -22.3 kcal/mol; ΔSea (est) = -2.7 eu. Mistakenly reported as 9-OMe-anthracene |

References

Heinis, Chowdhury, et al., 1993
Heinis, T.; Chowdhury, S.; Kebarle, P.,
Electron Affinities of Naphthalene, Anthracene and Substituted Naphthalenes and Anthracenes,
Org. Mass Spectrom., 1993, 28, 4, 358, https://doi.org/10.1002/oms.1210280416
. [all data]
Lang (editor), 1975
Lang (editor), L.,
Absorption Spectra in the Ultraviolet and Visible Region, 1975, 20, 201. [all data]