4-Hydroxybenzoic acid, 2TBDMS derivative
- Formula: C19H34O3Si2
- Molecular weight: 366.6425
- IUPAC Standard InChIKey: NZUMUAWQJATSIJ-UHFFFAOYSA-N
- CAS Registry Number: 78324-14-8
- Chemical structure:
View 3d structure (requires JavaScript / HTML 5) - Other names: Benzoic acid, 4-[(tert-butyldimethylsilyl)oxy]-, tert-butyldimethylsilyl ester; 4-Hydroxybenzoic acid, tert-butyldimethylsilyl ether, tert-butyldimethylsilyl ester; Benzoic acid, 4-hydroxy, bis-TBDMS; tert-Butyl(dimethyl)silyl 4-([tert-butyl(dimethyl)silyl]oxy)benzoate; Benzoic acid, 4-[(tert.-butyldimethylsilyl)oxy]-, tert.-butyldimethylsilyl ester; Benzoic acid, 4-hydroxy, TBDMS; 4-Hydroxybenzoic acid, TBDMS; p-Hydroxybenzoic acid, DMTBS

Van Den Dool and Kratz RI, non-polar column, custom temperature program

Column type | Active phase | I | Reference | Comment |
---|---|---|---|---|
Capillary | VF-5MS | 2115.5 | Tret'yakov, 2008 | 30. m/0.25 mm/0.25 μm, He; Program: Multi-step temperature program; T(initial)=60C; T(final)=270C |

Normal alkane RI, non-polar column, temperature ramp

Column type | Active phase | I | Reference | Comment |
---|---|---|---|---|
Capillary | DB-5 | 2118. | Paik, Lee, et al., 2005 | 30. m/0.25 mm/0.25 μm, Helium, 60. C @ 2. min, 4. K/min; Tend: 290. C |
Capillary | DB-5 | 2119.15 | Kim, Kim, et al., 1993 | 30. m/0.25 mm/0.241 μm, 4. K/min; Tstart: 60. C; Tend: 280. C |
Capillary | DB-5 | 2122. | Kim, Kim, et al., 1990 | 30. m/0.25 mm/0.25 μm, 3. K/min; Tstart: 60. C; Tend: 280. C |
Capillary | DB-1 | 2097. | Kim, Hahn, et al., 1989 | 30. m/0.32 mm/0.25 μm, N2, 60. C @ 2. min, 4. K/min; Tend: 280. C |

References

Tret'yakov, 2008
Tret'yakov, K.V.,
Retention Data. NIST Mass Spectrometry Data Center., NIST Mass Spectrometry Data Center, 2008. [all data]
Paik, Lee, et al., 2005
Paik, M.-J.; Lee, H.-J.; Kim, K.-R.,
Simultaneous retention index analysis of urinary amino acids and carboxylic acids for graphic recognition of abnormal state,
J. Chromatogr. B, 2005, 821, 1, 94-104, https://doi.org/10.1016/j.jchromb.2005.04.011
. [all data]
Kim, Kim, et al., 1993
Kim, K.-R.; Kim, J.-H.; Park, H.-K.; Oh, C.-H.,
Dual capillary column system for the qualitative gas chromatography: 2. Comparison between splitless and on-column injection modes,
Bull. Korean Chem. Soc., 1993, 14, 2, 250-255. [all data]
Kim, Kim, et al., 1990
Kim, K.-R.; Kim, J.-H.; Park, H.-K.,
Trace analysis as TBDMS derivatives of organic acids in aqueous samples,
J. Korean Chem. Soc., 1990, 34, 4, 352-359. [all data]
Kim, Hahn, et al., 1989
Kim, K.R.; Hahn, M.K.; Zlatkis, A.; Horning, E.C.; Middleditch, B.S.,
Simultaneous gas chromatography of volatile and nonvolatile carboxylic acids as tert.-butyldimethylsilyl derivatives,
J. Chromatogr., 1989, 468, 289-301, https://doi.org/10.1016/S0021-9673(00)96323-4
. [all data]