9-Methyltricyclo[4.2.1.1(2,5)]deca-3,7-diene-9,10-diol

Normal alkane RI, non-polar column, temperature ramp

Data compiled by: NIST Mass Spectrometry Data Center, William E. Wallace, director

Column type Capillary
Active phase RTX-5
Column length (m) 10.
Carrier gas He
Substrate
Column diameter (mm) 0.18
Phase thickness (μm) 0.2
Tstart (C) 40.
Tend (C) 275.
Heat rate (K/min) 50.
Initial hold (min) 0.5
Final hold (min) 0.5
I 1299.
ReferenceSetkova, Risticevic, et al., 2007
Comment MSDC-RI

References

Setkova, Risticevic, et al., 2007
Setkova, L.; Risticevic, S.; Pawliszyn, J., Rapid headspace solid-phase microextraction-gas chromatographic?time-of-flight mass spectrometric method for qualitative profiling of ice wine volatile fraction II: Classification of Canadian and Czech ice wines using statistical evaluation of the data, J. Chromatogr. A, 2007, 1147, 2, 224-240, https://doi.org/10.1016/j.chroma.2007.02.052 . [all data]