trans-1-Methoxycyclopentadecene
- Formula: C16H30O
- Molecular weight: 238.4088
- IUPAC Standard InChIKey: PJMSFACMMWSXKJ-JQIJEIRASA-N
- CAS Registry Number: 78289-15-3
- Chemical structure:

Reaction thermochemistry data

Data compiled by: Hussein Y. Afeefy, Joel F. Liebman, and Stephen E. Stein
Individual Reactions
By formula: C16H30O = C16H30O
Quantity | Value | Units | Method | Reference | Comment |
---|---|---|---|---|---|
ΔrH° | -0.65 ± 0.12 | kcal/mol | Eqk | Taskinen, 1980 | liquid phase; solvent: Cyclohexane |

References

Taskinen, 1980
Taskinen, E.,
Thermodynamics of vinyl ethers. XXVI. Relative stabilities of the geometrical isomers of 8- to 15-membered 1-methoxycycloalkenes,
Acta Chem. Scand., Ser. B, 1980, 643-646. [all data]