Cyclodecene, 1-methoxy-, (Z)-
- Formula: C11H20O
- Molecular weight: 168.2759
- IUPAC Standard InChIKey: NWRHWUHZMHRZEM-PKNBQFBNSA-N
- CAS Registry Number: 78289-12-0
- Chemical structure:

Reaction thermochemistry data

Data compiled by: Hussein Y. Afeefy, Joel F. Liebman, and Stephen E. Stein
Individual Reactions
By formula: C11H20O = C11H20O
Quantity | Value | Units | Method | Reference | Comment |
---|---|---|---|---|---|
ΔrH° | -4.97 ± 0.29 | kcal/mol | Eqk | Taskinen, 1980 | liquid phase; solvent: Cyclohexane |

References

Taskinen, 1980
Taskinen, E.,
Thermodynamics of vinyl ethers. XXVI. Relative stabilities of the geometrical isomers of 8- to 15-membered 1-methoxycycloalkenes,
Acta Chem. Scand., Ser. B, 1980, 643-646. [all data]