trans-1-Methoxycyclotridecene
- Formula: C14H26O
- Molecular weight: 210.3556
- IUPAC Standard InChIKey: DQNSWVPJRZTUNF-OWBHPGMISA-N
- CAS Registry Number: 78289-10-8
- Chemical structure:
View 3d structure (requires JavaScript / HTML 5) - Stereoisomers:

Reaction thermochemistry data

Data compiled by: Hussein Y. Afeefy, Joel F. Liebman, and Stephen E. Stein
Individual Reactions
By formula: C14H26O = C14H26O
Quantity | Value | Units | Method | Reference | Comment |
---|---|---|---|---|---|
ΔrH° | -7.2 ± 0.3 | kJ/mol | Eqk | Taskinen, 1980 | liquid phase; solvent: Cyclohexane |

References

Taskinen, 1980
Taskinen, E.,
Thermodynamics of vinyl ethers. XXVI. Relative stabilities of the geometrical isomers of 8- to 15-membered 1-methoxycycloalkenes,
Acta Chem. Scand., Ser. B, 1980, 643-646. [all data]