trans-1-Methoxycyclodecene
- Formula: C11H20O
- Molecular weight: 168.2759
- IUPAC Standard InChIKey: NWRHWUHZMHRZEM-LUAWRHEFSA-N
- CAS Registry Number: 78289-08-4
- Chemical structure:
View 3d structure (requires JavaScript / HTML 5) - Stereoisomers:

Reaction thermochemistry data

Data compiled by: Hussein Y. Afeefy, Joel F. Liebman, and Stephen E. Stein
Individual Reactions
By formula: C11H20O = C11H20O
Quantity | Value | Units | Method | Reference | Comment |
---|---|---|---|---|---|
ΔrH° | -20.8 ± 1.2 | kJ/mol | Eqk | Taskinen, 1980 | liquid phase; solvent: Cyclohexane |

References

Taskinen, 1980
Taskinen, E.,
Thermodynamics of vinyl ethers. XXVI. Relative stabilities of the geometrical isomers of 8- to 15-membered 1-methoxycycloalkenes,
Acta Chem. Scand., Ser. B, 1980, 643-646. [all data]