1,1-Dimethoxy-3,3-dimethylbutane
- Formula: C8H18O2
- Molecular weight: 146.2273
- IUPAC Standard InChIKey: XQXASMBOOKNENN-UHFFFAOYSA-N
- CAS Registry Number: 78263-32-8
- Chemical structure:
View 3d structure (requires JavaScript / HTML 5) - Permanent link for this species. Use this link for bookmarking this species for future reference.

Reaction thermochemistry data

Data compiled by: Hussein Y. Afeefy, Joel F. Liebman, and Stephen E. Stein
Individual Reactions
By formula: H2O + C8H18O2 = C6H12O + 2CH4O
Quantity | Value | Units | Method | Reference | Comment |
---|---|---|---|---|---|
ΔrH° | 33.34 ± 0.15 | kJ/mol | Eqk | Wiberg and Squires, 1981 | liquid phase |

References

Wiberg and Squires, 1981
Wiberg, K.B.; Squires, R.R.,
Thermochemical studies of carbonyl reactions. 2. Steric effects in acetal and ketal hydrolysis,
J. Am. Chem. Soc., 1981, 103, 4473-4478. [all data]