1,3-Propanediol, 2-methyl-2-propyl-
- Formula: C7H16O2
- Molecular weight: 132.2007
- IUPAC Standard InChIKey: JVZZUPJFERSVRN-UHFFFAOYSA-N
- CAS Registry Number: 78-26-2
- Chemical structure:
View 3d structure (requires JavaScript / HTML 5) - Other names: 2-Methyl-2-propyl-1,3-propanediol; 2-Methyl-2-n-propyl-1,3-propanediol; 2-methyl-2-propylpropane-1,3-diol

Phase change data

Data compiled as indicated in comments:
BS - Robert L. Brown and Stephen E. Stein
TRC - Thermodynamics Research Center, NIST Boulder Laboratories, Chris Muzny director
Quantity | Value | Units | Method | Reference | Comment |
---|---|---|---|---|---|
Tfus | 328.9 | K | N/A | Anonymous, 1954 | Uncertainty assigned by TRC = 0.6 K; TRC |
Reduced pressure boiling point
Tboil (K) | Pressure (bar) | Reference | Comment |
---|---|---|---|
503.2 | 1.00 | Aldrich Chemical Company Inc., 1990 | BS |

References

Anonymous, 1954
Anonymous, R.,
, Am. Pet. Inst. Res. Proj. 45, Tech. Rep. 13, Ohio State Univ., 1954. [all data]
Aldrich Chemical Company Inc., 1990
Aldrich Chemical Company Inc.,
Catalog Handbook of Fine Chemicals, Aldrich Chemical Company, Inc., Milwaukee WI, 1990, 1. [all data]