Pyrene, 4,5,9,10-tetrahydro-
- Formula: C16H14
- Molecular weight: 206.2824
- IUPAC Standard InChIKey: XDFUNRTWHPWCKO-UHFFFAOYSA-N
- CAS Registry Number: 781-17-9
- Chemical structure:
View 3d structure (requires JavaScript / HTML 5) - Other names: 4,5,9,10-Tetrahydropyrene

Gas phase thermochemistry data

Data compiled by: Hussein Y. Afeefy, Joel F. Liebman, and Stephen E. Stein
Quantity | Value | Units | Method | Reference | Comment |
---|---|---|---|---|---|
ΔfH°gas | 90.2 ± 1.4 | kJ/mol | Ccb | Chirico, Knipmeyer, et al., 1993 |

Condensed phase thermochemistry data

Data compiled as indicated in comments:
ALS - Hussein Y. Afeefy, Joel F. Liebman, and Stephen E. Stein
DH - Eugene S. Domalski and Elizabeth D. Hearing
Quantity | Value | Units | Method | Reference | Comment |
---|---|---|---|---|---|
ΔfH°solid | 25.2 ± 1.5 | kJ/mol | Ccb | Chirico, Knipmeyer, et al., 1993 | ALS |
Quantity | Value | Units | Method | Reference | Comment |
ΔcH°solid | -8322.2 ± 1.2 | kJ/mol | Ccb | Chirico, Knipmeyer, et al., 1993 | Corresponding ΔfHºsolid = 25.21 kJ/mol (simple calculation by NIST; no Washburn corrections); ALS |
Quantity | Value | Units | Method | Reference | Comment |
S°solid,1 bar | 247.77 | J/mol*K | N/A | Chirico, Knipmeyer, et al., 1993 | crystaline, II phase; DH |
Constant pressure heat capacity of solid
Cp,solid (J/mol*K) | Temperature (K) | Reference | Comment |
---|---|---|---|
257.12 | 298.15 | Chirico, Knipmeyer, et al., 1993 | crystaline, II phase; T = 5 to 500 K.; DH |

Phase change data

Data compiled as indicated in comments:
TRC - Thermodynamics Research Center, NIST Boulder Laboratories, Chris Muzny director
AC - William E. Acree, Jr., James S. Chickos
DRB - Donald R. Burgess, Jr.
DH - Eugene S. Domalski and Elizabeth D. Hearing
Quantity | Value | Units | Method | Reference | Comment |
---|---|---|---|---|---|
Ttriple | 412.720 | K | N/A | Chirico, Knipmeyer, et al., 1993, 2 | Crystal phase 1 phase; Uncertainty assigned by TRC = 0.01 K; TRC |
Quantity | Value | Units | Method | Reference | Comment |
ΔsubH° | 65.0 | kJ/mol | N/A | Chirico, Knipmeyer, et al., 1993 | DRB |
Enthalpy of vaporization
ΔvapH (kJ/mol) | Temperature (K) | Method | Reference | Comment |
---|---|---|---|---|
70.9 | 440. | EB,IP | Chirico, Knipmeyer, et al., 1993 | AC |
68.1 | 480. | EB,IP | Chirico, Knipmeyer, et al., 1993 | AC |
65.3 | 520. | EB,IP | Chirico, Knipmeyer, et al., 1993 | AC |
62.5 | 560. | EB,IP | Chirico, Knipmeyer, et al., 1993 | AC |
59.5 | 600. | EB,IP | Chirico, Knipmeyer, et al., 1993 | AC |
56.4 | 640. | EB,IP | Chirico, Knipmeyer, et al., 1993 | AC |
Enthalpy of sublimation
ΔsubH (kJ/mol) | Temperature (K) | Method | Reference | Comment |
---|---|---|---|---|
90.4 | 400. | IP | Chirico, Knipmeyer, et al., 1993 | Based on data from 385. to 410. K.; AC |
Enthalpy of fusion
ΔfusH (kJ/mol) | Temperature (K) | Reference | Comment |
---|---|---|---|
17.09 | 412.8 | Chirico, Knipmeyer, et al., 1993 | AC |
Enthalpy of phase transition
ΔHtrs (kJ/mol) | Temperature (K) | Initial Phase | Final Phase | Reference | Comment |
---|---|---|---|---|---|
3.6709 | 319.9 | crystaline, III | crystaline, II | Chirico, Knipmeyer, et al., 1993 | DH |
0.2611 | 385.1 | crystaline, II | crystaline, I | Chirico, Knipmeyer, et al., 1993 | DH |
17.0938 | 412.725 | crystaline, I | liquid | Chirico, Knipmeyer, et al., 1993 | DH |

Lee's RI, non-polar column, temperature ramp

Column type | Active phase | I | Reference | Comment |
---|---|---|---|---|
Capillary | DB-5 | 325.7 | Durlak, Biswas, et al., 1998 | 30. m/0.25 mm/0.25 μm, 15. K/min; Tstart: 50. C; Tend: 300. C |
Capillary | DB-5 | 325.7 | Durlak, Biswas, et al., 1998 | 30. m/0.25 mm/0.25 μm, 15. K/min; Tstart: 50. C; Tend: 300. C |
Capillary | SE-52 | 328.26 | Hasegawa, Muragishi, et al., 1988 | 3. K/min; Column length: 25. m; Column diameter: 0.25 mm; Tstart: 130. C; Tend: 260. C |
Capillary | SE-52 | 329.69 | Lee, Vassilaros, et al., 1979 | 12. m/0.3 mm/0.34 μm, He, 2. K/min; Tstart: 50. C; Tend: 250. C |

Lee's RI, non-polar column, custom temperature program

Column type | Active phase | I | Reference | Comment |
---|---|---|---|---|
Capillary | LM-5 | 329.11 | Ré-Poppi and Santiago-Silva, 2005 | 30. m/0.25 mm/0.25 μm, He; Program: 60C(2min) => 15C/min => 180C => 5C/min => 280C (10min) |
Capillary | LM-5 | 328.95 | Ré-Poppi and Santiago-Silva, 2002 | 30. m/0.25 mm/0.25 μm, He; Program: 60C(2min) => 15C/min => 180C => 5C/min => 280C(5min) |
Capillary | SE-52 | 329.69 | Shlyakhov, 1984 | Program: not specified |

References

Chirico, Knipmeyer, et al., 1993
Chirico, R.D.; Knipmeyer, S.E.; Nguyen, A.; Smith, N.K.; Steele, W.V.,
The thermodynamic properties of 4,5,9,10-tetra-hydropyrene and of 1,2,3,6,7,8-hexahydropyrene,
J. Chem. Thermodyn., 1993, 25, 729-761. [all data]
Chirico, Knipmeyer, et al., 1993, 2
Chirico, R.D.; Knipmeyer, S.E.; Nguyen, A.; Smith, N.K.; Steele, W.V.,
The thermodynamic properties of 4,5,9,10-tetrahydropyrene and of 1,2,3,6,7,8-hexahydropyrene,
J. Chem. Thermodyn., 1993, 25, 729-61. [all data]
Durlak, Biswas, et al., 1998
Durlak, S.K.; Biswas, P.; Shi, J.; Bernhard, M.J.,
Characterization of polycyclic aromatic hydrocarbon particulate and gaseous emissions from polystyrene combustion,
Environ. Sci. Technol., 1998, 32, 15, 2301-2307, https://doi.org/10.1021/es9709031
. [all data]
Hasegawa, Muragishi, et al., 1988
Hasegawa, K.; Muragishi, T.; Usami, S.,
Component analysis of coal-derivated heavy oil. Analysis of carcinogenic components in neutral nonpolar fractions,
Nippon Kagaku Kaishi, 1988, 3, 3, 311-320, https://doi.org/10.1246/nikkashi.1988.311
. [all data]
Lee, Vassilaros, et al., 1979
Lee, M.L.; Vassilaros, D.L.; White, C.M.; Novotny, M.,
Retention Indices for Programmed-Temperature Capillary-Column Gas Chromatography of Polycyclic Aromatic Hydrocarbons,
Anal. Chem., 1979, 51, 6, 768-773, https://doi.org/10.1021/ac50042a043
. [all data]
Ré-Poppi and Santiago-Silva, 2005
Ré-Poppi, N.; Santiago-Silva, M.,
Polycyclic aromatic hydrocarbons and other selected organic compounds in ambient air of Campo Grande City, Brazil,
Atmos. Environ., 2005, 39, 16, 2839-2850, https://doi.org/10.1016/j.atmosenv.2004.10.006
. [all data]
Ré-Poppi and Santiago-Silva, 2002
Ré-Poppi, N.; Santiago-Silva, M.R.,
Identification of polycyclic aromatic hydrocarbons and methoxylated phenols in wood smoke emitted during production of charcoal,
Chromatographia, 2002, 55, 7/8, 475-481, https://doi.org/10.1007/BF02492280
. [all data]
Shlyakhov, 1984
Shlyakhov, A.F.,
Gas chromatography in organic geochemistry, Nedra, Moscow, 1984, 221. [all data]