Silane, triethoxyphenyl-
- Formula: C12H20O3Si
- Molecular weight: 240.3709
- IUPAC Standard InChIKey: JCVQKRGIASEUKR-UHFFFAOYSA-N
- CAS Registry Number: 780-69-8
- Chemical structure:
View 3d structure (requires JavaScript / HTML 5) - Other names: Benzeneorthosiliconic acid, triethyl ester; Phenyltriethoxysilane; Triethoxyphenylsilane; Silane, phenyltriethoxy-; Triethoxyfenylsilan; CP0320

Phase change data

Data compiled as indicated in comments:
AC - William E. Acree, Jr., James S. Chickos
Quantity | Value | Units | Method | Reference | Comment |
---|---|---|---|---|---|
ΔvapH° | 13.9 ± 0.2 | kcal/mol | C | Voronkov, Baryshok, et al., 1988 | AC |
Enthalpy of vaporization
ΔvapH (kcal/mol) | Temperature (K) | Reference | Comment |
---|---|---|---|
14.8 | 359. | Stull, 1947 | Based on data from 344. to 506. K.; AC |
Antoine Equation Parameters
log10(P) = A − (B / (T + C))
P = vapor pressure (atm)
T = temperature (K)
View plot Requires a JavaScript / HTML 5 canvas capable browser.
Temperature (K) | A | B | C | Reference | Comment |
---|---|---|---|---|---|
344. to 506.7 | 5.1413 | 2327.698 | -54.052 | Stull, 1947 | Coefficents calculated by NIST from author's data. |

References

Voronkov, Baryshok, et al., 1988
Voronkov, M.G.; Baryshok, V.P.; Klyuchnikov, V.A.; Danilova, T.F.; Pepekin, V.I.; Korchagina, A.N.; Khudobin, Yu.I.,
Thermochemistry of organosilicon compounds,
Journal of Organometallic Chemistry, 1988, 345, 1-2, 27-38, https://doi.org/10.1016/0022-328X(88)80231-6
. [all data]
Stull, 1947
Stull, Daniel R.,
Vapor Pressure of Pure Substances. Organic and Inorganic Compounds,
Ind. Eng. Chem., 1947, 39, 4, 517-540, https://doi.org/10.1021/ie50448a022
. [all data]