1,1-diethylcyclohexane
- Formula: C10H20
- Molecular weight: 140.2658
- IUPAC Standard InChIKey: GCYUJISWSVALJD-UHFFFAOYSA-N
- CAS Registry Number: 78-01-3
- Chemical structure:
View 3d structure (requires JavaScript / HTML 5) - Permanent link for this species. Use this link for bookmarking this species for future reference.

Phase change data

Data compiled by: Thermodynamics Research Center, NIST Boulder Laboratories, Chris Muzny director
Quantity | Value | Units | Method | Reference | Comment |
---|---|---|---|---|---|
Tboil | 447. | K | N/A | Schmerling, 1949 | Uncertainty assigned by TRC = 4. K |
Tboil | 452.7 | K | N/A | Buck, Elsner, et al., 1948 | Uncertainty assigned by TRC = 0.4 K |

References

Schmerling, 1949
Schmerling, L.,
Condensation of Saturated Halidesw with Unsaturated Compounds V. Conden- sation of Cycloalkyl Halides with Ethylene and Vinyl Halides,
J. Am. Chem. Soc., 1949, 71, 698. [all data]
Buck, Elsner, et al., 1948
Buck, F.R.; Elsner, B.B.; Forbes, E.J.; Morrell, S.H.; Smith, J.C.; Wallsgrove, E.R.,
The Use of Zinc Alkyls in the Preparation of Hydrocarbons with a Quaternary Carbon Atom,
J. Inst. Pet., 1948, 34, 339. [all data]