Salicylidene aniline
- Formula: C13H11NO
- Molecular weight: 197.2325
- IUPAC Standard InChIKey: QIYHCQVVYSSDTI-UHFFFAOYSA-N
- CAS Registry Number: 779-84-0
- Chemical structure:
View 3d structure (requires JavaScript / HTML 5) - Other names: α-(Phenylimino)-ortho-cresol; o-Hydroxy benzylidene aniline; N-Salicylideneaniline; Phenol, 2-((phenylimino)methyl)-; N-(2-Hydroxybenzylidene)aniline; O-Cresol, α-phenyl imino-; 2-Hydroxybenzaldehyde N-phenylimine; O-cresol, alpha-phenyl imino-

Phase change data

Data compiled by: William E. Acree, Jr., James S. Chickos
Enthalpy of sublimation
ΔsubH (kJ/mol) | Temperature (K) | Method | Reference | Comment |
---|---|---|---|---|
115.9 | 303. | A | Stephenson and Malanowski, 1987 | Based on data from 288. to 325. K. |
129.9 | 378. | N/A | Hoyer and Peperle, 1958 | Based on data from 348. to 408. K. |

References

Stephenson and Malanowski, 1987
Stephenson, Richard M.; Malanowski, Stanislaw,
Handbook of the Thermodynamics of Organic Compounds, 1987, https://doi.org/10.1007/978-94-009-3173-2
. [all data]
Hoyer and Peperle, 1958
Hoyer, H.; Peperle, W.,
Z. Elektrochem., 1958, 62, 61. [all data]