(E)-1-Iodo-1-propene
- Formula: C3H5I
- Molecular weight: 167.9763
- IUPAC Standard InChIKey: QYQQTZFOFMPYCA-NSCUHMNNSA-N
- CAS Registry Number: 7796-54-5
- Chemical structure:
View 3d structure (requires JavaScript / HTML 5) - Stereoisomers:

Gas phase thermochemistry data

Data compiled by: Hussein Y. Afeefy, Joel F. Liebman, and Stephen E. Stein
Quantity | Value | Units | Method | Reference | Comment |
---|---|---|---|---|---|
ΔfH°gas | 93.1 ± 3.6 | kJ/mol | Eqk | Alfassi, Golden, et al., 1973 | Reanalyzed by Pedley, Naylor, et al., 1986, Original value = 96.2 kJ/mol |

Reaction thermochemistry data

Data compiled by: Hussein Y. Afeefy, Joel F. Liebman, and Stephen E. Stein
Individual Reactions
By formula: C3H5I = C3H5I
Quantity | Value | Units | Method | Reference | Comment |
---|---|---|---|---|---|
ΔrH° | -2. | kJ/mol | Eqk | Alfassi, Golden, et al., 1973 | gas phase |

References

Alfassi, Golden, et al., 1973
Alfassi, Z.B.; Golden, D.M.; Benson, S.W.,
The thermochemistry of the isomerization of 3-halopropenes (allyl halides) to 1-halopropenes; entropy and enthalpy of formation contribution of the Cd-(H)(X) group,
J. Chem. Thermodyn., 1973, 5, 411-420. [all data]
Pedley, Naylor, et al., 1986
Pedley, J.B.; Naylor, R.D.; Kirby, S.P.,
Thermochemical Data of Organic Compounds, Chapman and Hall, New York, 1986, 1-792. [all data]