seleninyl dichloride
- Formula: Cl2OSe
- Molecular weight: 165.87
- IUPAC Standard InChIKey: LIRMPIXWGWLNND-UHFFFAOYSA-N
- CAS Registry Number: 7791-23-3
- Chemical structure:
View 3d structure (requires JavaScript / HTML 5) - Other names: Selenium oxychloride

Reaction thermochemistry data

Data compiled by: John E. Bartmess
Individual Reactions
+
= Cl3OSe-
By formula: Cl- + Cl2OSe = Cl3OSe-
Quantity | Value | Units | Method | Reference | Comment |
---|---|---|---|---|---|
ΔrH° | 149.8 | kJ/mol | N/A | Lobring, Hao, et al., 2003 | gas phase |

Ion clustering data

Data compiled by: John E. Bartmess
Clustering reactions
+
= Cl3OSe-
By formula: Cl- + Cl2OSe = Cl3OSe-
Quantity | Value | Units | Method | Reference | Comment |
---|---|---|---|---|---|
ΔrH° | 149.8 | kJ/mol | N/A | Lobring, Hao, et al., 2003 | gas phase |

References

Lobring, Hao, et al., 2003
Lobring, K.C.; Hao, C.T.; Forbes, J.K.; Ivanov, M.R.J.; Bachrach, S.M.; Sunderlin, L.S.,
Bond strengths in ChCl(3)(-) and ChOCl(3)(-) (Ch = S, Se, Te): Experiment and theory,
J. Phys. Chem. A, 2003, 107, 50, 11153-11160, https://doi.org/10.1021/jp030388v
. [all data]