Chloridosulfuric acid
- Formula: ClHO3S
- Molecular weight: 116.524
- IUPAC Standard InChIKey: XTHPWXDJESJLNJ-UHFFFAOYSA-N
- CAS Registry Number: 7790-94-5
- Chemical structure:
View 3d structure (requires JavaScript / HTML 5) - Other names: chlorosulphuric acid; Chlorosulfonic acid

Phase change data

Data compiled by: William E. Acree, Jr., James S. Chickos
Enthalpy of vaporization
ΔvapH (kJ/mol) | Temperature (K) | Reference | Comment |
---|---|---|---|
45.8 | 339. | Dykyj, Svoboda, et al., 1999 | Based on data from 324. to 454. K. |

Reaction thermochemistry data

Data compiled by: Hussein Y. Afeefy, Joel F. Liebman, and Stephen E. Stein
Individual Reactions
By formula: C15H32O + ClHO3S = C15H32O4S + HCl
Quantity | Value | Units | Method | Reference | Comment |
---|---|---|---|---|---|
ΔrH° | 56. ± 3. | kJ/mol | Cm | Markitanova, Barsukov, et al., 1981 | liquid phase; solvent: Dichloromethane; Sulfation |
+
= C16H34O4S +
By formula: C16H34O + ClHO3S = C16H34O4S + HCl
Quantity | Value | Units | Method | Reference | Comment |
---|---|---|---|---|---|
ΔrH° | 57. ± 3. | kJ/mol | Cm | Markitanova, Barsukov, et al., 1981 | liquid phase; solvent: Dichloromethane; Sulfation |
By formula: C4H10O + ClHO3S = C4H10O4S + HCl
Quantity | Value | Units | Method | Reference | Comment |
---|---|---|---|---|---|
ΔrH° | 58. ± 1. | kJ/mol | Cm | Markitanova, Barsukov, et al., 1981 | liquid phase; solvent: Dichloromethane; Sulfation |
By formula: C11H24O + ClHO3S = C11H24O4S + HCl
Quantity | Value | Units | Method | Reference | Comment |
---|---|---|---|---|---|
ΔrH° | 60. ± 3. | kJ/mol | Cm | Markitanova, Barsukov, et al., 1981 | liquid phase; solvent: Dichloromethane; Sulfation |
+
= C8H18O4S +
By formula: C8H18O + ClHO3S = C8H18O4S + HCl
Quantity | Value | Units | Method | Reference | Comment |
---|---|---|---|---|---|
ΔrH° | 55. ± 1. | kJ/mol | Cm | Markitanova, Barsukov, et al., 1981 | liquid phase; solvent: Dichloromethane; Sulfation |

References

Dykyj, Svoboda, et al., 1999
Dykyj, J.; Svoboda, J.; Wilhoit, R.C.; Frenkel, M.L.; Hall, K.R.,
Vapor Pressure of Chemicals: Part A. Vapor Pressure and Antoine Constants for Hydrocarbons and Sulfur, Selenium, Tellurium and Hydrogen Containing Organic Compounds, Springer, Berlin, 1999, 373. [all data]
Markitanova, Barsukov, et al., 1981
Markitanova, L.I.; Barsukov, I.I.; Passet, B.V.,
Determination of heat of sulfation by calorimetric titration,
J. Gen. Chem. USSR, 1981, 51, 1286-1289. [all data]