chloric acid
- Formula: ClHO3
- Molecular weight: 84.459
- CAS Registry Number: 7790-93-4

Reaction thermochemistry data

Data compiled by: John E. Bartmess
Individual Reactions
ClO3- + = HClO3
By formula: ClO3- + H+ = HClO3
Quantity | Value | Units | Method | Reference | Comment |
---|---|---|---|---|---|
ΔrH° | 1310. ± 14. | kJ/mol | IMRB | Meyer and Kass, 2010 | gas phase |
ΔrH° | <1300. ± 50. | kJ/mol | D-EA | Alekseev, Fedorova, et al., 1983 | gas phase; From ClO3F |
Quantity | Value | Units | Method | Reference | Comment |
ΔrG° | 1284. ± 16. | kJ/mol | H-TS | Meyer and Kass, 2010 | gas phase |

Gas phase ion energetics data

Data compiled by: John E. Bartmess
De-protonation reactions
ClO3- + = HClO3
By formula: ClO3- + H+ = HClO3
Quantity | Value | Units | Method | Reference | Comment |
---|---|---|---|---|---|
ΔrH° | 1310. ± 14. | kJ/mol | IMRB | Meyer and Kass, 2010 | gas phase |
ΔrH° | <1300. ± 50. | kJ/mol | D-EA | Alekseev, Fedorova, et al., 1983 | gas phase; From ClO3F |
Quantity | Value | Units | Method | Reference | Comment |
ΔrG° | 1284. ± 16. | kJ/mol | H-TS | Meyer and Kass, 2010 | gas phase |

References

Meyer and Kass, 2010
Meyer, M.M.; Kass, S.R.,
Experimental and Theoretical Gas-Phase Acidities, Bond Dissociation Energies, and Heats of Formation of HClOx, x=1-4,
J. Phys. Chem. A, 2010, 114, 12, 4086-4092, https://doi.org/10.1021/jp100888k
. [all data]
Alekseev, Fedorova, et al., 1983
Alekseev, V.I.; Fedorova, L.I.; Baluev, A.V.,
Mass Spectrometric Study of Thermochemical Characteristics of Perchloryl Fluoride and its Decomposition Product Chlorosyl Fluoride, Izv. Akad. Nauk SSR Ser. Khim. 1084, 1983. [all data]