Tributyl acetylcitrate
- Formula: C20H34O8
- Molecular weight: 402.4792
- IUPAC Standard InChIKey: QZCLKYGREBVARF-UHFFFAOYSA-N
- CAS Registry Number: 77-90-7
- Chemical structure:
View 3d structure (requires JavaScript / HTML 5) - Other names: 1,2,3-Propanetricarboxylic acid, 2-(acetyloxy)-, tributyl ester; Citric acid, tributyl ester, acetate; Blo-trol; Citroflex A; Citroflex A 4; Tributyl acetylicitrate; Tributyl citrate acetate; Tributyl O-acetylcitrate; Tributyl 2-(acetyloxy)-1,2,3-propanetricarboxylic acid; Tributyl 2-acetoxy-1,2,3-propanetricarboxylate; 2-Acetoxy-1,2,3-propanetricarboxylic acid tributyl ester; Acetyl tributyl citrate; 2-(Acetyloxy)-1,2,3-propane tricarboxylic acid, tributyl ester; Acetyl butyl citrate; Acetyl tri-n-butyl citrate; Acetylcitric acid, tributyl ester; Estaflex ATC; O-Acetylcitric acid tributyl ester; Tributyl 2-(acetyloxy)-1,2,3-propanetricarboxylate; Uniplex 84; 1,2,3-Propanetricarboxylic acid, 2-acetoxy-, tributyl ester; 1,2,3-Propanetricarboxylic acid, 2-(acetyloxy)-, 1,2,3-tributyl ester; NSC 3894

Condensed phase thermochemistry data

Data compiled by: Hussein Y. Afeefy, Joel F. Liebman, and Stephen E. Stein
Quantity | Value | Units | Method | Reference | Comment |
---|---|---|---|---|---|
ΔfH°solid | -1848. | kJ/mol | Ccb | Baroody and Carpenter, 1972 |

Phase change data

Data compiled by: Robert L. Brown and Stephen E. Stein
Reduced pressure boiling point
Tboil (K) | Pressure (bar) | Reference |
---|---|---|
446. | 0.001 | Frinton Laboratories Inc., 1986 |

Kovats' RI, non-polar column, custom temperature program

Column type | Active phase | I | Reference | Comment |
---|---|---|---|---|
Packed | SE-30 | 2253. | Ramsey, Lee, et al., 1980 | He, Chromosorb G HP (80-100 mesh); Column length: 1.5 m; Program: not specified |
Packed | SE-30 | 2224. | Ramsey, Lee, et al., 1980 | He, Chromosorb G HP (80-100 mesh); Column length: 1.5 m; Program: not specified |

Normal alkane RI, non-polar column, custom temperature program

Column type | Active phase | I | Reference | Comment |
---|---|---|---|---|
Capillary | SLB-5 MS | 2250. | Mondello, 2012 | 30. m/0.25 mm/0.25 μm, Helium; Program: not specified |
Capillary | SLB-5 MS | 2254. | Mondello, 2012 | 30. m/0.25 mm/0.25 μm, Helium; Program: not specified |
Capillary | OV-1, SE-30, Methyl silicone, SP-2100, OV-101, DB-1, etc. | 2253. | Waggott and Davies, 1984 | Hydrogen; Column length: 50. m; Column diameter: 0.32 mm; Program: not specified |
Other | Methyl Silicone | 2253. | Ardrey and Moffat, 1981 | Program: not specified |
Other | Methyl Silicone | 2224. | Ardrey and Moffat, 1981 | Program: not specified |

References

Baroody and Carpenter, 1972
Baroody, E.E.; Carpenter, G.A.,
Heats of formation of propellant compounds (U), Rpt. Naval Ordnance Systems Command Task No. 331-003/067-1/UR2402-001 for Naval Ordance Station, Indian Head, MD, 1972, 1-9. [all data]
Frinton Laboratories Inc., 1986
Frinton Laboratories Inc.,
Catalog Number 11, Frinton Laboratories Inc., Vineland, NJ, 1986, 99. [all data]
Ramsey, Lee, et al., 1980
Ramsey, J.D.; Lee, T.D.; Osselton, M.D.; Moffat, A.C.,
Gas-liquid chromatographic retention indices of 296 non-drug substances on SE-30 or OV-1 likely to be encountered in toxicological analyses,
J. Chromatogr., 1980, 184, 2, 185-206, https://doi.org/10.1016/S0021-9673(00)85641-1
. [all data]
Mondello, 2012
Mondello, L.,
HS-SPME-GCxGC-MS analysis of Yerba Mate (Ilex paraguariensis)
in Shimadzu GC-GC application compendium of comprehensive 2D GC, Vol. 1-5, Shimadzu Corp., 2012, 1-29. [all data]
Waggott and Davies, 1984
Waggott, A.; Davies, I.W.,
Identification of organic pollutants using linear temperature programmed retention indices (LTPRIs) - Part II, 1984, retrieved from http://dwi.defra.gov.uk/research/completed-research/reports/dwi0383.pdf. [all data]
Ardrey and Moffat, 1981
Ardrey, R.E.; Moffat, A.C.,
Gas-liquid chromatographic retention indices of 1318 substances of toxicological interest on SE-30 or OV-1 stationary phase,
J. Chromatogr., 1981, 220, 3, 195-252, https://doi.org/10.1016/S0021-9673(00)81925-1
. [all data]