2-propenoic acid, 2-(2-cyanoethoxy)ethyl ester
- Formula: C8H11NO3
- Molecular weight: 169.1778
- IUPAC Standard InChIKey: NHSMWDVLDUDINY-UHFFFAOYSA-N
- CAS Registry Number: 7790-03-6
- Chemical structure:
View 3d structure (requires JavaScript / HTML 5) - Permanent link for this species. Use this link for bookmarking this species for future reference.

Phase change data

Data compiled by: Thermodynamics Research Center, NIST Boulder Laboratories, Chris Muzny director
Quantity | Value | Units | Method | Reference | Comment |
---|---|---|---|---|---|
Tfus | 244.5 | K | N/A | Anonymous, 1958 | Uncertainty assigned by TRC = 0.4 K |

References

Anonymous, 1958
Anonymous, R.,
, Am. Pet. Inst. Res. Proj. 45, Ohio State Univ., 1958. [all data]