1-Pentanol, 2-methyl-, acetate
- Formula: C8H16O2
- Molecular weight: 144.2114
- IUPAC Standard InChIKey: UZTVUHTZGGZFCI-UHFFFAOYSA-N
- CAS Registry Number: 7789-99-3
- Chemical structure:
View 3d structure (requires JavaScript / HTML 5) - Other names: Acetic acid 2-methylpentyl ester; Acetic acid, 2-methylamyl ester; 2-Methylamyl acetate; 2-Methylamylester kyseliny octove; 2-Methylpentyl acetate

Van Den Dool and Kratz RI, non-polar column, temperature ramp

Column type | Active phase | I | Reference | Comment |
---|---|---|---|---|
Capillary | 5 % Phenyl methyl siloxane | 984. | Zaikin, 2010 | 30. m/0.25 mm/0.25 μm, 15. K/min, 270. C @ 15. min; Tstart: 60. C |

References

Zaikin, 2010
Zaikin, V.G.,
Personal communication: Retention indices measured during 2010, 2010. [all data]