tribromosilane
- Formula: Br3HSi
- Molecular weight: 268.805
- IUPAC Standard InChIKey: IBOKZQNMFSHYNQ-UHFFFAOYSA-N
- CAS Registry Number: 7789-57-3
- Chemical structure:
View 3d structure (requires JavaScript / HTML 5) - Other names: Silane, tribromo-

Gas phase thermochemistry data

Quantity | Value | Units | Method | Reference | Comment |
---|---|---|---|---|---|
ΔfH°gas | -302.92 | kJ/mol | Review | Chase, 1998 | Data last reviewed in December, 1976 |
Quantity | Value | Units | Method | Reference | Comment |
S°gas,1 bar | 348.04 | J/mol*K | Review | Chase, 1998 | Data last reviewed in December, 1976 |
Gas Phase Heat Capacity (Shomate Equation)
Cp° = A + B*t + C*t2 + D*t3 +
E/t2
H° − H°298.15= A*t + B*t2/2 +
C*t3/3 + D*t4/4 − E/t + F − H
S° = A*ln(t) + B*t + C*t2/2 + D*t3/3 −
E/(2*t2) + G
Cp = heat capacity (J/mol*K)
H° = standard enthalpy (kJ/mol)
S° = standard entropy (J/mol*K)
t = temperature (K) / 1000.
View plot Requires a JavaScript / HTML 5 canvas capable browser.
Temperature (K) | 298. to 1200. | 1200. to 6000. |
---|---|---|
A | 76.37474 | 105.5238 |
B | 51.17367 | 1.359583 |
C | -35.12054 | -0.264638 |
D | 9.270281 | 0.017795 |
E | -0.743355 | -5.962577 |
F | -330.1707 | -348.9146 |
G | 422.5087 | 455.3907 |
H | -302.9224 | -302.9224 |
Reference | Chase, 1998 | Chase, 1998 |
Comment | Data last reviewed in December, 1976 | Data last reviewed in December, 1976 |

Phase change data

Data compiled as indicated in comments:
AC - William E. Acree, Jr., James S. Chickos
Enthalpy of vaporization
ΔvapH (kJ/mol) | Temperature (K) | Reference | Comment |
---|---|---|---|
34.8 | 333. | Schumb and Bickford, 1934 | Based on data from 273. to 393. K.; AC |
Antoine Equation Parameters
log10(P) = A − (B / (T + C))
P = vapor pressure (bar)
T = temperature (K)
View plot Requires a JavaScript / HTML 5 canvas capable browser.
Temperature (K) | A | B | C | Reference | Comment |
---|---|---|---|---|---|
242.7 to 385.0 | 4.20267 | 1472.899 | -34.372 | Stull, 1947 | Coefficents calculated by NIST from author's data. |

Vibrational and/or electronic energy levels

Data compiled by: Takehiko Shimanouchi
Symmetry: C3ν Symmetry Number σ = 3
Sym. | No | Approximate | Selected Freq. | Infrared | Raman | Comments | ||||
---|---|---|---|---|---|---|---|---|---|---|
Species | type of mode | Value | Rating | Value | Phase | Value | Phase | |||
a1 | 1 | SiH str | 2239 | B | 2239.2 S | gas | 2236 p | liq. | ||
a1 | 2 | SiBr3 s-str | 362 | C | 362 M b | gas | 362 p | liq. | ||
a1 | 3 | SiBr3 s-deform | 168 | B | 168.5 M | gas | 166 p | liq. | ||
e | 4 | SiH bend | 774 | C | 774 VS | gas | 770 dp | liq. | ||
e | 5 | SiBr3 d-str | 484 | C | 483.5 VS | gas | 470 dp | liq. | ||
e | 6 | SiBr3 d-deform | 117 | C | 116.8 W | gas | 115 dp | liq. | ||
Source: Shimanouchi, 1972

References

Chase, 1998
Chase, M.W., Jr.,
NIST-JANAF Themochemical Tables, Fourth Edition,
J. Phys. Chem. Ref. Data, Monograph 9, 1998, 1-1951. [all data]
Schumb and Bickford, 1934
Schumb, Walter C.; Bickford, Fred A.,
The Vapor Pressure of Silicobromoform,
J. Am. Chem. Soc., 1934, 56, 4, 852-854, https://doi.org/10.1021/ja01319a025
. [all data]
Stull, 1947
Stull, Daniel R.,
Vapor Pressure of Pure Substances. Organic and Inorganic Compounds,
Ind. Eng. Chem., 1947, 39, 4, 517-540, https://doi.org/10.1021/ie50448a022
. [all data]
Shimanouchi, 1972
Shimanouchi, T.,
Tables of Molecular Vibrational Frequencies Consolidated Volume II,
J. Phys. Chem. Ref. Data, 1972, 6, 3, 993-1102. [all data]