copper difluoride
- Formula: CuF2
- Molecular weight: 101.543
- CAS Registry Number: 7789-19-7

Gas phase thermochemistry data

Quantity | Value | Units | Method | Reference | Comment |
---|---|---|---|---|---|
ΔfH°gas | -266.94 | kJ/mol | Review | Chase, 1998 | Data last reviewed in December, 1977 |
Quantity | Value | Units | Method | Reference | Comment |
S°gas,1 bar | 267.08 | J/mol*K | Review | Chase, 1998 | Data last reviewed in December, 1977 |
Gas Phase Heat Capacity (Shomate Equation)
Cp° = A + B*t + C*t2 + D*t3 +
E/t2
H° − H°298.15= A*t + B*t2/2 +
C*t3/3 + D*t4/4 − E/t + F − H
S° = A*ln(t) + B*t + C*t2/2 + D*t3/3 −
E/(2*t2) + G
Cp = heat capacity (J/mol*K)
H° = standard enthalpy (kJ/mol)
S° = standard entropy (J/mol*K)
t = temperature (K) / 1000.
View plot Requires a JavaScript / HTML 5 canvas capable browser.
Temperature (K) | 2500. to 6000. |
---|---|
A | 38.99710 |
B | 10.72924 |
C | -1.280217 |
D | 0.041196 |
E | 12.78086 |
F | -260.8624 |
G | 327.2909 |
H | -266.9392 |
Reference | Chase, 1998 |
Comment | Data last reviewed in December, 1977 |

Reaction thermochemistry data

Data compiled by: John E. Bartmess
Individual Reactions
By formula: F- + CuF2 = (F- • CuF2)
Quantity | Value | Units | Method | Reference | Comment |
---|---|---|---|---|---|
ΔrH° | 351. ± 17. | kJ/mol | TDEq | Kuznetsov, Korobov, et al., 1986 | gas phase; Anchor:F-(FeF3) Chilingarov, Korobov, et al., 1984; value altered from reference due to conversion from electron convention to ion convention |

Condensed phase thermochemistry data

Quantity | Value | Units | Method | Reference | Comment |
---|---|---|---|---|---|
ΔfH°liquid | -116.60 | kcal/mol | Review | Chase, 1998 | Data last reviewed in December, 1977 |
Quantity | Value | Units | Method | Reference | Comment |
S°liquid,1 bar | 29.297 | cal/mol*K | Review | Chase, 1998 | Data last reviewed in December, 1977 |
Quantity | Value | Units | Method | Reference | Comment |
ΔfH°solid | -128.80 | kcal/mol | Review | Chase, 1998 | Data last reviewed in December, 1977 |
Quantity | Value | Units | Method | Reference | Comment |
S°solid | 18.49 | cal/mol*K | Review | Chase, 1998 | Data last reviewed in December, 1977 |
Liquid Phase Heat Capacity (Shomate Equation)
Cp° = A + B*t + C*t2 + D*t3 +
E/t2
H° − H°298.15= A*t + B*t2/2 +
C*t3/3 + D*t4/4 − E/t + F − H
S° = A*ln(t) + B*t + C*t2/2 + D*t3/3 −
E/(2*t2) + G
Cp = heat capacity (cal/mol*K)
H° = standard enthalpy (kcal/mol)
S° = standard entropy (cal/mol*K)
t = temperature (K) / 1000.
View plot Requires a JavaScript / HTML 5 canvas capable browser.
Temperature (K) | 1109. to 2500. |
---|---|
A | 24.00000 |
B | 5.373351×10-9 |
C | -2.710240×10-9 |
D | 4.611141×10-10 |
E | 6.129080×10-10 |
F | -126.1630 |
G | 53.05100 |
H | -116.6000 |
Reference | Chase, 1998 |
Comment | Data last reviewed in December, 1977 |
Solid Phase Heat Capacity (Shomate Equation)
Cp° = A + B*t + C*t2 + D*t3 +
E/t2
H° − H°298.15= A*t + B*t2/2 +
C*t3/3 + D*t4/4 − E/t + F − H
S° = A*ln(t) + B*t + C*t2/2 + D*t3/3 −
E/(2*t2) + G
Cp = heat capacity (cal/mol*K)
H° = standard enthalpy (kcal/mol)
S° = standard entropy (cal/mol*K)
t = temperature (K) / 1000.
View plot Requires a JavaScript / HTML 5 canvas capable browser.
Temperature (K) | 298. to 1109. |
---|---|
A | 13.85690 |
B | 14.31220 |
C | -7.802890 |
D | 1.423910 |
E | -0.162204 |
F | -134.0520 |
G | 30.41200 |
H | -128.8000 |
Reference | Chase, 1998 |
Comment | Data last reviewed in December, 1977 |

Gas phase ion energetics data

Data compiled as indicated in comments:
LLK - Sharon G. Lias, Rhoda D. Levin, and Sherif A. Kafafi
RDSH - Henry M. Rosenstock, Keith Draxl, Bruce W. Steiner, and John T. Herron
Ionization energy determinations
IE (eV) | Method | Reference | Comment |
---|---|---|---|
12.7 | PE | Dyke, Fayad, et al., 1980 | LLK |
13.3 ± 0.1 | EI | Ehlert and Wang, 1977 | LLK |
11.3 ± 0.3 | EI | Kent, McDonald, et al., 1966 | RDSH |
13.18 | PE | Dyke, Fayad, et al., 1980 | Vertical value; LLK |
Appearance energy determinations
Ion | AE (eV) | Other Products | Method | Reference | Comment |
---|---|---|---|---|---|
Cu+ | 16.5 ± 0.3 | ? | EI | Kent, McDonald, et al., 1966 | RDSH |
CuF+ | 12.4 ± 0.3 | F | EI | Kent, McDonald, et al., 1966 | RDSH |

Ion clustering data

Data compiled by: John E. Bartmess

Clustering reactions

Fluorine anion + CuF2 = (Fluorine anion • CuF2)

By formula: F- + CuF2 = (F- • CuF2)

Quantity Value Units Method Reference Comment
Δr351. ± 17.kJ/molTDEqKuznetsov, Korobov, et al., 1986gas phase; Anchor:F-(FeF3) Chilingarov, Korobov, et al., 1984; value altered from reference due to conversion from electron convention to ion convention

References

Chase, 1998
Chase, M.W., Jr.,
NIST-JANAF Themochemical Tables, Fourth Edition,
J. Phys. Chem. Ref. Data, Monograph 9, 1998, 1-1951. [all data]
Kuznetsov, Korobov, et al., 1986
Kuznetsov, S.V.; Korobov, M.V.; Savinova, L.N.; Sidirov, L.N.,
Enthalpy of the addition of the F- ion to copper and iron difluorides,
Russ. J. Phys. Chem., 1986, 60, 766. [all data]
Chilingarov, Korobov, et al., 1984
Chilingarov, N.S.; Korobov, M.V.; Sidirov, L.N.; Mitkin, V.N.; Shipachev, V.A.; Zemskov, S.V.,
Electron affinity of rhodium tetrafluoride,
J. Chem. Thermodyn., 1984, 16, 965. [all data]