1H-Indole-3-acetic acid, ethyl ester
- Formula: C12H13NO2
- Molecular weight: 203.2371
- IUPAC Standard InChIKey: HUDBDWIQSIGUDI-UHFFFAOYSA-N
- CAS Registry Number: 778-82-5
- Chemical structure:
View 3d structure (requires JavaScript / HTML 5) - Other names: Indole-3-acetic acid, ethyl ester; Ethyl β-indolylacetate; Ethyl indol-3-ylacetate; Ethyl indole-3-acetate; Ethyl 3-indoleacetate; Ethyl 3-indolylacetate; Ethyl 1H-indol-3-ylacetate; NSC 38002; 3-Indoleacetic acid, ethyl ester

Phase change data

Data compiled by: Robert L. Brown and Stephen E. Stein
Reduced pressure boiling point
Tboil (K) | Pressure (bar) | Reference |
---|---|---|
438.2 | 0.001 | Aldrich Chemical Company Inc., 1990 |

Van Den Dool and Kratz RI, non-polar column, custom temperature program

Column type | Active phase | I | Reference | Comment |
---|---|---|---|---|
Capillary | VF-5MS | 1903. | Tretyakov, 2011 | 30. m/0.25 mm/0.25 μm, He; Program: Multi-step temperature program; T(initial)=60C; T(final)=270C |

References

Aldrich Chemical Company Inc., 1990
Aldrich Chemical Company Inc.,
Catalog Handbook of Fine Chemicals, Aldrich Chemical Company, Inc., Milwaukee WI, 1990, 1. [all data]
Tretyakov, 2011
Tretyakov, K.V.,
Retention Data. NIST Mass Spectrometry Data Center., NIST Mass Spectrometry Data Center, 2011. [all data]