beryllium dibromide
- Formula: BeBr2
- Molecular weight: 168.820
- IUPAC Standard InChIKey: PBKYCFJFZMEFRS-UHFFFAOYSA-L
- CAS Registry Number: 7787-46-4
- Chemical structure:
View 3d structure (requires JavaScript / HTML 5) - Other names: Beryllium bromide

Gas phase thermochemistry data

Quantity | Value | Units | Method | Reference | Comment |
---|---|---|---|---|---|
ΔfH°gas | -229.28 | kJ/mol | Review | Chase, 1998 | Data last reviewed in June, 1975 |
Quantity | Value | Units | Method | Reference | Comment |
S°gas,1 bar | 273.82 | J/mol*K | Review | Chase, 1998 | Data last reviewed in June, 1975 |
Gas Phase Heat Capacity (Shomate Equation)
Cp° = A + B*t + C*t2 + D*t3 +
E/t2
H° − H°298.15= A*t + B*t2/2 +
C*t3/3 + D*t4/4 − E/t + F − H
S° = A*ln(t) + B*t + C*t2/2 + D*t3/3 −
E/(2*t2) + G
Cp = heat capacity (J/mol*K)
H° = standard enthalpy (kJ/mol)
S° = standard entropy (J/mol*K)
t = temperature (K) / 1000.
View plot Requires a JavaScript / HTML 5 canvas capable browser.
Temperature (K) | 298. to 6000. |
---|---|
A | 59.27556 |
B | 2.551325 |
C | -0.679402 |
D | 0.057349 |
E | -0.625751 |
F | -249.1605 |
G | 341.3048 |
H | -229.2832 |
Reference | Chase, 1998 |
Comment | Data last reviewed in June, 1975 |

Condensed phase thermochemistry data

Quantity | Value | Units | Method | Reference | Comment |
---|---|---|---|---|---|
ΔfH°solid | -355.64 | kJ/mol | Review | Chase, 1998 | Data last reviewed in June, 1975 |
Quantity | Value | Units | Method | Reference | Comment |
S°solid | 100.37 | J/mol*K | Review | Chase, 1998 | Data last reviewed in June, 1975 |
Solid Phase Heat Capacity (Shomate Equation)
Cp° = A + B*t + C*t2 + D*t3 +
E/t2
H° − H°298.15= A*t + B*t2/2 +
C*t3/3 + D*t4/4 − E/t + F − H
S° = A*ln(t) + B*t + C*t2/2 + D*t3/3 −
E/(2*t2) + G
Cp = heat capacity (J/mol*K)
H° = standard enthalpy (kJ/mol)
S° = standard entropy (J/mol*K)
t = temperature (K) / 1000.
View plot Requires a JavaScript / HTML 5 canvas capable browser.
Temperature (K) | 298. to 1500. |
---|---|
A | 52.23138 |
B | 68.54898 |
C | -51.37157 |
D | 14.71693 |
E | -0.222923 |
F | -374.5977 |
G | 144.0396 |
H | -355.6404 |
Reference | Chase, 1998 |
Comment | Data last reviewed in June, 1975 |

References

Chase, 1998
Chase, M.W., Jr.,
NIST-JANAF Themochemical Tables, Fourth Edition,
J. Phys. Chem. Ref. Data, Monograph 9, 1998, 1-1951. [all data]