Cyclohexanol, 5-methyl-2-(1-methylethenyl)-
- Formula: C10H18O
- Molecular weight: 154.2493
- IUPAC Standard InChIKey: ZYTMANIQRDEHIO-AEJSXWLSSA-N
- CAS Registry Number: 7786-67-6
- Chemical structure:
View 3d structure (requires JavaScript / HTML 5) - Species with the same structure:
- Stereoisomers:
- Other names: p-Menth-8-en-3-ol; Isopregol; 1-Methyl-4-isopropenylcyclohexan-3-ol; 8(9)-p-Menthen-3-ol; Isopulegol; 5-methyl-2-(1-methylvinyl)cyclohexan-1-ol; (d) isopulegol

Phase change data

Data compiled by: William E. Acree, Jr., James S. Chickos
Enthalpy of vaporization
ΔvapH (kJ/mol) | Temperature (K) | Method | Reference | Comment |
---|---|---|---|---|
49.8 | 350. | A | Stephenson and Malanowski, 1987 | Based on data from 335. to 485. K. |

References

Stephenson and Malanowski, 1987
Stephenson, Richard M.; Malanowski, Stanislaw,
Handbook of the Thermodynamics of Organic Compounds, 1987, https://doi.org/10.1007/978-94-009-3173-2
. [all data]