1,1-diphenyl-1-propene
- Formula: C15H14
- Molecular weight: 194.2717
- IUPAC Standard InChIKey: KYVBUUNCHXRYOS-UHFFFAOYSA-N
- CAS Registry Number: 778-66-5
- Chemical structure:
View 3d structure (requires JavaScript / HTML 5) - Permanent link for this species. Use this link for bookmarking this species for future reference.

Phase change data

Data compiled by: Thermodynamics Research Center, NIST Boulder Laboratories, Chris Muzny director
Quantity | Value | Units | Method | Reference | Comment |
---|---|---|---|---|---|
Tboil | 558. | K | N/A | Adam, Baeza, et al., 1972 | Uncertainty assigned by TRC = 0.003 K |
Tboil | 557.7 | K | N/A | Sabatier and Murat, 1915 | Uncertainty assigned by TRC = 2. K |
Quantity | Value | Units | Method | Reference | Comment |
Tfus | 323. | K | N/A | Adam, Baeza, et al., 1972 | Uncertainty assigned by TRC = 3. K |
Tfus | 324.65 | K | N/A | Lewis and Wright, 1952 | Uncertainty assigned by TRC = 2. K |
Tfus | 321. | K | N/A | Somerville and Spoerri, 1951 | Uncertainty assigned by TRC = 2. K |
Tfus | 318. | K | N/A | Kern, Shriner, et al., 1925 | Uncertainty assigned by TRC = 2. K |
Tfus | 324.7 | K | N/A | Sabatier and Murat, 1915 | Uncertainty assigned by TRC = 2. K |

References

Adam, Baeza, et al., 1972
Adam, W.; Baeza, J.; Liu, J.-C.,
Stereospecific Introduction o f Double Bonds via Thermolysis of β-Lactones,
J. Am. Chem. Soc., 1972, 94, 2000. [all data]
Sabatier and Murat, 1915
Sabatier, P.; Murat, M.,
Ann. Chim. (Paris), 1915, 4, 253. [all data]
Lewis and Wright, 1952
Lewis, R.N.; Wright, J.R.,
J. Am. Chem. Soc., 1952, 74, 1253. [all data]
Somerville and Spoerri, 1951
Somerville, W.T.; Spoerri, P.E.,
The Friedel-Crafts Reaction with Disubsituted Ethylene Oxides II. α-Methylstyrene Oxide,
J. Am. Chem. Soc., 1951, 73, 697. [all data]
Kern, Shriner, et al., 1925
Kern, J.W.; Shriner, R.L.; Adams, R.,
Platinum and Palladium Oxides as Catalysts in the Reduction of Organic Compounds IX. The Reduction of Olefins,
J. Am. Chem. Soc., 1925, 47, 1147. [all data]