(1R)-2,6,6-Trimethylbicyclo[3.1.1]hept-2-ene
- Formula: C10H16
- Molecular weight: 136.2340
- IUPAC Standard InChIKey: GRWFGVWFFZKLTI-VEDVMXKPSA-N
- CAS Registry Number: 7785-70-8
- Chemical structure:
View 3d structure (requires JavaScript / HTML 5) - Species with the same structure:
- Stereoisomers:
- Other names: 1R-α-Pinene; Bicyclo[3.1.1]hept-2-ene, 2,6,6-trimethyl-, (1R)-; 2,6,6-Trimethylbicyclo[3.1.1]hept-2-ene-, (1R,5R)-; d-α-Pinene; 1R-(+)-α-Pinene; (R)-α-Pinene; α-Pinene, (D)-; Dextro-alpha-pinene; (+)-pin-2(3)-ene; α-Pinene(dextro)

Condensed phase thermochemistry data

Data compiled by: Hussein Y. Afeefy, Joel F. Liebman, and Stephen E. Stein
Quantity | Value | Units | Method | Reference | Comment |
---|---|---|---|---|---|
ΔcH°liquid | -6156.8 | kJ/mol | Ccb | Auwsers, Roth, et al., 1910 | Corresponding ΔfHºliquid = -64.9 kJ/mol (simple calculation by NIST; no Washburn corrections) |

Phase change data

Data compiled by: Robert L. Brown and Stephen E. Stein
Quantity | Value | Units | Method | Reference | Comment |
---|---|---|---|---|---|
Tboil | 428.2 | K | N/A | Aldrich Chemical Company Inc., 1990 |

Kovats' RI, non-polar column, temperature ramp

Column type | Active phase | I | Reference | Comment |
---|---|---|---|---|
Capillary | DB-5 | 937. | Dickens, 1999 | 30. m/0.25 mm/0.25 μm, 50. C @ 2. min, 15. K/min, 235. C @ 2. min |

Kovats' RI, non-polar column, custom temperature program

Column type | Active phase | I | Reference | Comment |
---|---|---|---|---|
Capillary | DB-5 | 937. | Dickens J.C., 2000 | Program: not specified |

Van Den Dool and Kratz RI, non-polar column, temperature ramp

Column type | Active phase | I | Reference | Comment |
---|---|---|---|---|
Capillary | DB-5 | 935. | Zeller and Rychlik, 2006 | 30. m/0.32 mm/0.25 μm, He, 40. C @ 1. min, 6. K/min; Tend: 230. C |

Van Den Dool and Kratz RI, non-polar column, custom temperature program

Column type | Active phase | I | Reference | Comment |
---|---|---|---|---|
Capillary | VF-5MS | 922. | Carasek and Pawliszyn, 2006 | 30. m/0.25 mm/0.25 μm, He; Program: 40C(2min) => 5C/min => 200C (2min) => 30C/min => 260C |
Capillary | VF-5MS | 922. | Carasek and Pawliszyn, 2006 | 30. m/0.25 mm/0.25 μm, He; Program: 40C(2min) => 5C/min => 200C (2min) => 30C/min => 260C |
Capillary | SE-54 | 929. | Buettner and Schieberle, 1999 | 30. m/0.32 mm/0.25 μm, He; Program: 35C (2min) => 40C/min => 50C (2min) => 6C/min => 180C => 10C/min => 230C (10min) |
Capillary | SE-54 | 929. | Hinterholzer and Schieberie, 1998 | 30. m/0.32 mm/0.25 μm, He; Program: 35C(2min) => 40C/min => 50C(2min) => 6C/min => 180C => 10C/min => 230C(10min) |

Van Den Dool and Kratz RI, polar column, temperature ramp

Column type | Active phase | I | Reference | Comment |
---|---|---|---|---|
Capillary | DB-FFAP | 1016. | Zeller and Rychlik, 2006 | 30. m/0.32 mm/0.25 μm, He, 40. C @ 1. min, 6. K/min; Tend: 230. C |

Van Den Dool and Kratz RI, polar column, custom temperature program

Column type | Active phase | I | Reference | Comment |
---|---|---|---|---|
Capillary | FFAP | 1010. | Buettner and Schieberle, 1999 | 30. m/0.32 mm/0.25 μm, He; Program: 35C (2min) => 40C/min => 60C (2min) => 6C/min => 180C => 10C/min => 230C (10min) |

References

Auwsers, Roth, et al., 1910
Auwsers, K.; Roth, W.A.; Eisenlohr, F.,
III. Verbrennungswarmen von Terpenen und Styrolen,
Justus Liebigs Ann. Chem., 1910, 267-290. [all data]
Aldrich Chemical Company Inc., 1990
Aldrich Chemical Company Inc.,
Catalog Handbook of Fine Chemicals, Aldrich Chemical Company, Inc., Milwaukee WI, 1990, 1. [all data]
Dickens, 1999
Dickens, J.C.,
Predator-prey interactions: olfactory adaptations of generalist and specialist predators,
Agric. For. Entomol., 1999, 1, 1, 47-54, https://doi.org/10.1046/j.1461-9563.1999.00007.x
. [all data]
Dickens J.C., 2000
Dickens J.C.,
Sexual maturation and temporal variation of neural responses in adult Colorado potato beetles to volatiles emitted by potato plants,
J. Chem. Ecol., 2000, 26, 5, 1265-1279, https://doi.org/10.1023/A:1005492229377
. [all data]
Zeller and Rychlik, 2006
Zeller, A.; Rychlik, M.,
Character impact odorants of fennel fruits and fennel tea,
J. Agric. Food Chem., 2006, 54, 10, 3686-3692, https://doi.org/10.1021/jf052944j
. [all data]
Carasek and Pawliszyn, 2006
Carasek, E.; Pawliszyn, J.,
Screening of Tropical Fruit Volatile Compounds Using Solid-Phase Microextraction (SPME) Fibers and Internally Cooled SPME Fiber,
J. Agric. Food Chem., 2006, 54, 23, 8688-8696, https://doi.org/10.1021/jf0613942
. [all data]
Buettner and Schieberle, 1999
Buettner, A.; Schieberle, P.,
Characterization of the most odor-active volatiles in fresh, hand squeezed juice of grapefruit (Citrus paradise Macfayden),
J. Agric. Food Chem., 1999, 47, 12, 5189-5193, https://doi.org/10.1021/jf990071l
. [all data]
Hinterholzer and Schieberie, 1998
Hinterholzer, A.; Schieberie, P.,
Identification of the most odour-active volatiles in fresh, hand-extracted juice of valencia late oranges by odour dilution techniques,
Flavour Fragr. J., 1998, 13, 1, 49-55, https://doi.org/10.1002/(SICI)1099-1026(199801/02)13:1<49::AID-FFJ691>3.0.CO;2-S
. [all data]