(1S)-2,6,6-Trimethylbicyclo[3.1.1]hept-2-ene
- Formula: C10H16
- Molecular weight: 136.2340
- IUPAC Standard InChIKey: GRWFGVWFFZKLTI-VEDVMXKPSA-N
- CAS Registry Number: 7785-26-4
- Chemical structure:
View 3d structure (requires JavaScript / HTML 5) - Species with the same structure:
- Stereoisomers:
- Other names: 1S-α-Pinene; (-)-α-Pinene; L-α-Pinene; Bicyclo[3.1.1]hept-2-ene, 2,6,6-trimethyl-, (1S)-; 2,6,6-Trimethylbicyclo[3.1.1]hept-2-ene-, (1S,5S)-; α-Pinene, (-)-; (1S)-(-)-α-Pinene; 1S-(-)-a-pinene; (-)-pin-2(3)-ene

Condensed phase thermochemistry data

Data compiled by: Hussein Y. Afeefy, Joel F. Liebman, and Stephen E. Stein
Quantity | Value | Units | Method | Reference | Comment |
---|---|---|---|---|---|
ΔcH°liquid | -1470.0 | kcal/mol | Ccb | Auwsers, Roth, et al., 1910 | Corresponding ΔfHºliquid = -17.0 kcal/mol (simple calculation by NIST; no Washburn corrections) |

Phase change data

Data compiled as indicated in comments:
BS - Robert L. Brown and Stephen E. Stein
TRC - Thermodynamics Research Center, NIST Boulder Laboratories, Chris Muzny director
Quantity | Value | Units | Method | Reference | Comment |
---|---|---|---|---|---|
Tboil | 428.2 | K | N/A | Weast and Grasselli, 1989 | BS |
Quantity | Value | Units | Method | Reference | Comment |
Tfus | 218.39 | K | N/A | Gomes, Serrano, et al., 1988 | Uncertainty assigned by TRC = 0.15 K; TRC |

Kovats' RI, non-polar column, isothermal

Column type | Active phase | Temperature (C) | I | Reference | Comment |
---|---|---|---|---|---|
Capillary | ZB-1 | 100. | 941.76 | Hoskovec, Grygarová, et al., 2005 | 30. m/0.32 mm/1. μm, He |
Capillary | ZB-1 | 110. | 945.19 | Hoskovec, Grygarová, et al., 2005 | 30. m/0.32 mm/1. μm, He |
Capillary | ZB-1 | 120. | 948.69 | Hoskovec, Grygarová, et al., 2005 | 30. m/0.32 mm/1. μm, He |
Capillary | ZB-1 | 130. | 952.3 | Hoskovec, Grygarová, et al., 2005 | 30. m/0.32 mm/1. μm, He |
Capillary | ZB-1 | 140. | 955.94 | Hoskovec, Grygarová, et al., 2005 | 30. m/0.32 mm/1. μm, He |
Capillary | ZB-1 | 150. | 959.63 | Hoskovec, Grygarová, et al., 2005 | 30. m/0.32 mm/1. μm, He |
Capillary | ZB-1 | 160. | 963.45 | Hoskovec, Grygarová, et al., 2005 | 30. m/0.32 mm/1. μm, He |
Capillary | ZB-1 | 170. | 967.39 | Hoskovec, Grygarová, et al., 2005 | 30. m/0.32 mm/1. μm, He |
Capillary | ZB-1 | 60. | 928.69 | Hoskovec, Grygarová, et al., 2005 | 30. m/0.32 mm/1. μm, He |
Capillary | ZB-1 | 70. | 931.87 | Hoskovec, Grygarová, et al., 2005 | 30. m/0.32 mm/1. μm, He |
Capillary | ZB-1 | 80. | 935.08 | Hoskovec, Grygarová, et al., 2005 | 30. m/0.32 mm/1. μm, He |
Capillary | ZB-1 | 90. | 938.37 | Hoskovec, Grygarová, et al., 2005 | 30. m/0.32 mm/1. μm, He |
Capillary | ZB-1 | 100. | 941.85 | Hoskovec, Grygarová, et al., 2005 | 30. m/0.32 mm/0.25 μm, He |
Capillary | ZB-1 | 110. | 945.26 | Hoskovec, Grygarová, et al., 2005 | 30. m/0.32 mm/0.25 μm, He |
Capillary | ZB-1 | 120. | 948.88 | Hoskovec, Grygarová, et al., 2005 | 30. m/0.32 mm/0.25 μm, He |
Capillary | ZB-1 | 130. | 952.43 | Hoskovec, Grygarová, et al., 2005 | 30. m/0.32 mm/0.25 μm, He |
Capillary | ZB-1 | 140. | 956.02 | Hoskovec, Grygarová, et al., 2005 | 30. m/0.32 mm/0.25 μm, He |
Capillary | ZB-1 | 40. | 922.57 | Hoskovec, Grygarová, et al., 2005 | 30. m/0.32 mm/0.25 μm, He |
Capillary | ZB-1 | 50. | 925.64 | Hoskovec, Grygarová, et al., 2005 | 30. m/0.32 mm/0.25 μm, He |
Capillary | ZB-1 | 60. | 928.73 | Hoskovec, Grygarová, et al., 2005 | 30. m/0.32 mm/0.25 μm, He |
Capillary | ZB-1 | 70. | 931.91 | Hoskovec, Grygarová, et al., 2005 | 30. m/0.32 mm/0.25 μm, He |
Capillary | ZB-1 | 80. | 935.13 | Hoskovec, Grygarová, et al., 2005 | 30. m/0.32 mm/0.25 μm, He |
Capillary | ZB-1 | 90. | 938.44 | Hoskovec, Grygarová, et al., 2005 | 30. m/0.32 mm/0.25 μm, He |

Kovats' RI, non-polar column, temperature ramp

Column type | Active phase | I | Reference | Comment |
---|---|---|---|---|
Capillary | DB-5 | 937. | Dickens, 1999 | 30. m/0.25 mm/0.25 μm, 50. C @ 2. min, 15. K/min, 235. C @ 2. min |

Kovats' RI, non-polar column, custom temperature program

Column type | Active phase | I | Reference | Comment |
---|---|---|---|---|
Capillary | DB-5 | 937. | Dickens J.C., 2000 | Program: not specified |

Van Den Dool and Kratz RI, non-polar column, temperature ramp

Column type | Active phase | I | Reference | Comment |
---|---|---|---|---|
Capillary | Equity-5 | 959. | Rocha, Coelho, et al., 2007 | 60. m/0.25 mm/1. μm, He, 40. C @ 1. min, 5. K/min, 260. C @ 15. min |
Capillary | HP-5MS | 936. | Saroglou, Marin, et al., 2007 | 30. m/0.25 mm/0.25 μm, He, 60. C @ 5. min, 4. K/min; Tend: 280. C |
Capillary | HP-5MS | 934. | Saroglou, Dorizas, et al., 2006 | 30. m/0.25 mm/0.25 μm, He, 60. C @ 5. min, 4. K/min; Tend: 280. C |
Capillary | HP-5MS | 936. | Grujic-Jovanovic, Skaltsa, et al., 2004 | 30. m/0.25 mm/0.25 μm, He, 60. C @ 5. min, 4. K/min; Tend: 280. C |
Capillary | HP-5MS | 938. | Karioti, Hadjipavlou-Litina, et al., 2004 | 30. m/0.25 mm/0.25 μm, He, 60. C @ 5. min, 4. K/min; Tend: 280. C |

Van Den Dool and Kratz RI, polar column, temperature ramp

Column type | Active phase | I | Reference | Comment |
---|---|---|---|---|
Capillary | HP-Innowax | 1030. | Saroglou, Marin, et al., 2007 | 30. m/0.25 mm/0.5 μm, He, 3. K/min; Tstart: 60. C; Tend: 260. C |
Capillary | HP-Innowax | 1030. | Grujic-Jovanovic, Skaltsa, et al., 2004 | 30. m/0.25 mm/0.5 μm, He, 3. K/min; Tstart: 60. C; Tend: 260. C |
Capillary | CP-Wax 52CB | 1008. | Kjeldsen, Christensen, et al., 2003 | 50. m/0.25 mm/0.2 μm, He, 32. C @ 1. min, 1. K/min; Tend: 220. C |

Normal alkane RI, non-polar column, temperature ramp

Column type | Active phase | I | Reference | Comment |
---|---|---|---|---|
Capillary | DB-5 | 929. | Limberger, Sobral, et al., 2005 | 30. m/0.25 mm/0.25 μm, He, 3. K/min; Tstart: 60. C; Tend: 230. C |
Capillary | OV-101 | 930. | Orav, Kailas, et al., 2002 | 50. m/0.2 mm/0.5 μm, He, 2. K/min; Tstart: 50. C; Tend: 250. C |

Normal alkane RI, polar column, temperature ramp

Column type | Active phase | I | Reference | Comment |
---|---|---|---|---|
Capillary | Supelcowax-10 | 1029. | Orav, Kailas, et al., 2002 | 60. m/0.2 mm/0.5 μm, He, 2. K/min; Tstart: 70. C; Tend: 220. C |

References

Auwsers, Roth, et al., 1910
Auwsers, K.; Roth, W.A.; Eisenlohr, F.,
III. Verbrennungswarmen von Terpenen und Styrolen,
Justus Liebigs Ann. Chem., 1910, 267-290. [all data]
Weast and Grasselli, 1989
CRC Handbook of Data on Organic Compounds, 2nd Editon, Weast,R.C and Grasselli, J.G., ed(s)., CRC Press, Inc., Boca Raton, FL, 1989, 1. [all data]
Gomes, Serrano, et al., 1988
Gomes, A.; Serrano, L.; Fareio, F.,
Solid-Liquid Equilibria in 1,8-Cineole/TErpenic Hydrocarbon Systems,
J. Chem. Eng. Data, 1988, 33, 194. [all data]
Hoskovec, Grygarová, et al., 2005
Hoskovec, Michal; Grygarová, Dana; Cvacka, Josef; Streinz, Ludvík; Zima, Jirí; Verevkin, Sergey P.; Koutek, Bohumír,
Determining the vapour pressures of plant volatiles from gas chromatographic retention data,
Journal of Chromatography A, 2005, 1083, 1-2, 161-172, https://doi.org/10.1016/j.chroma.2005.06.006
. [all data]
Dickens, 1999
Dickens, J.C.,
Predator-prey interactions: olfactory adaptations of generalist and specialist predators,
Agric. For. Entomol., 1999, 1, 1, 47-54, https://doi.org/10.1046/j.1461-9563.1999.00007.x
. [all data]
Dickens J.C., 2000
Dickens J.C.,
Sexual maturation and temporal variation of neural responses in adult Colorado potato beetles to volatiles emitted by potato plants,
J. Chem. Ecol., 2000, 26, 5, 1265-1279, https://doi.org/10.1023/A:1005492229377
. [all data]
Rocha, Coelho, et al., 2007
Rocha, S.M.; Coelho, E.; Zrostlikova, J.; Delgadillo, I.; Coimbra b, M.A.,
Comprehensive two-dimensional gas chromatography with time-of-flight mass spectrometry of monoterpenoids as a powerful tool for grape origin traceability,
J. Chromatogr. A, 2007, 1161, 1-2, 292-299, https://doi.org/10.1016/j.chroma.2007.05.093
. [all data]
Saroglou, Marin, et al., 2007
Saroglou, V.; Marin, P.D.; Rancic, A.; Veljic, M.; Skaltsa, H.,
Composition and antimicrobial activity of the essential oil of six Hypericum species from Serbia,
Biochem. Syst. Ecol., 2007, 35, 3, 146-152, https://doi.org/10.1016/j.bse.2006.09.009
. [all data]
Saroglou, Dorizas, et al., 2006
Saroglou, V.; Dorizas, N.; Kypriotakis, Z.; Skaltsa, H.D.,
Analysis of the essential oil composition of eight Anthemis species from Greece,
J. Chromatogr. A, 2006, 1104, 1-2, 313-322, https://doi.org/10.1016/j.chroma.2005.11.087
. [all data]
Grujic-Jovanovic, Skaltsa, et al., 2004
Grujic-Jovanovic, S.; Skaltsa, H.D.; Marin, P.; Sokovic, M.,
Composition and antibacterial activity of the essential oil of six Stachys species from Serbia,
Flavour Fragr. J., 2004, 19, 2, 139-144, https://doi.org/10.1002/ffj.1275
. [all data]
Karioti, Hadjipavlou-Litina, et al., 2004
Karioti, A.; Hadjipavlou-Litina, D.; Mensah, M.L.K.; Fleischer, T.C.; Skaltsa, H.,
Composition and antioxidant activity of the essential oils of Xylopia aethiopica (Dun) A. Rich. (Annonaceae) leaves, stem bark, root bark, and fresh and dried fruits, growing in Ghana,
J. Agric. Food Chem., 2004, 52, 26, 8094-8098, https://doi.org/10.1021/jf040150j
. [all data]
Kjeldsen, Christensen, et al., 2003
Kjeldsen, F.; Christensen, L.P.; Edelenbos, M.,
Changes in volatile compounds of carrots (Daucus carota L.) during refrigerated and frozen storage,
J. Agric. Food Chem., 2003, 51, 18, 5400-5407, https://doi.org/10.1021/jf030212q
. [all data]
Limberger, Sobral, et al., 2005
Limberger, R.P.; Sobral, M.; Henriques, A.T.,
Intraspecific volatile oil variation in Myrceugenia cucullata (Myrtaceae),
Biochem. Syst. Ecol., 2005, 33, 3, 287-293, https://doi.org/10.1016/j.bse.2004.10.002
. [all data]
Orav, Kailas, et al., 2002
Orav, A.; Kailas, T.; Müürisepp, M.,
Composition of blackcurrant aroma isolated from leaves, buds, and berries of Ribes nigrum L.,
Proc. Est. Acad. Sci. Chem., 2002, 51, 4, 225-234. [all data]