antimony pentafluoride
- Formula: F5Sb
- Molecular weight: 216.752
- IUPAC Standard InChIKey: VBVBHWZYQGJZLR-UHFFFAOYSA-I
- CAS Registry Number: 7783-70-2
- Chemical structure:
View 3d structure (requires JavaScript / HTML 5) - Permanent link for this species. Use this link for bookmarking this species for future reference.

Phase change data

Data compiled by: Robert L. Brown and Stephen E. Stein
Quantity | Value | Units | Method | Reference | Comment |
---|---|---|---|---|---|
Tboil | 422.6 | K | N/A | PCR Inc., 1990 |

Reaction thermochemistry data

Data compiled by: John E. Bartmess
Individual Reactions
By formula: F- + F5Sb = (F- • F5Sb)
Quantity | Value | Units | Method | Reference | Comment |
---|---|---|---|---|---|
ΔrH° | 489.95 | kJ/mol | N/A | Check, Faust, et al., 2001 | gas phase; MnH2-(t); ; ΔS(EA)=5.4 |
Quantity | Value | Units | Method | Reference | Comment |
ΔrG° | 447.69 | kJ/mol | N/A | Check, Faust, et al., 2001 | gas phase; MnH2-(t); ; ΔS(EA)=5.4 |

Gas phase ion energetics data

Data compiled by: John E. Bartmess
Electron affinity determinations
EA (eV) | Method | Reference | Comment |
---|---|---|---|
1.30 ± 0.20 | NBIE | Russell, Herschberger, et al., 1985 | Negative ions not directly observed; see also Compton and Reinhardt, 1980 |
3.8872 | N/A | Check, Faust, et al., 2001 | MnH-(q); ; ΔS(acid)=20.9; ΔS(EA)=4.2 |

Ion clustering data

Data compiled by: John E. Bartmess
Clustering reactions
By formula: F- + F5Sb = (F- • F5Sb)
Quantity | Value | Units | Method | Reference | Comment |
---|---|---|---|---|---|
ΔrH° | 489.95 | kJ/mol | N/A | Check, Faust, et al., 2001 | gas phase; MnH2-(t); ; ΔS(EA)=5.4 |
Quantity | Value | Units | Method | Reference | Comment |
ΔrG° | 447.69 | kJ/mol | N/A | Check, Faust, et al., 2001 | gas phase; MnH2-(t); ; ΔS(EA)=5.4 |

References

PCR Inc., 1990
PCR Inc.,
Research Chemicals Catalog 1990-1991, PCR Inc., Gainesville, FL, 1990, 1. [all data]
Check, Faust, et al., 2001
Check, C.E.; Faust, T.O.; Bailey, J.M.; Wright, B.J.; Gilbert, T.M.; Sunderlin, L.S.,
Addition of Polarization and Diffuse Functions to the LANL2DZ Basis Set for P-Block Elements,
J. Phys. Chem. A,, 2001, 105, 34, 8111, https://doi.org/10.1021/jp011945l
. [all data]
Russell, Herschberger, et al., 1985
Russell, J.A.; Herschberger, J.F.; McAndrew, J.J.; Cross, R.J.; Saunders, M.,
Molecular Beam Studies of the Dynamics of Organic Electron Transfer Reactions,
J. Chem. Phys., 1985, 82, 5, 2240, https://doi.org/10.1063/1.448318
. [all data]
Compton and Reinhardt, 1980
Compton, R.W.; Reinhardt, P.W.,
Reactions of fast cesium atoms with polymers of antimony pentafluoride and gold pentafluoride,
J. Chem. Phys., 1980, 72, 4655. [all data]