zirconium tetrafluoride
- Formula: F4Zr
- Molecular weight: 167.218
- IUPAC Standard InChIKey: NLGFRLRLBUOAEJ-UHFFFAOYSA-M
- CAS Registry Number: 7783-64-4
- Chemical structure:

Gas phase thermochemistry data

Quantity | Value | Units | Method | Reference | Comment |
---|---|---|---|---|---|
ΔfH°gas | -1673.60 | kJ/mol | Review | Chase, 1998 | Data last reviewed in June, 1975 |
Quantity | Value | Units | Method | Reference | Comment |
S°gas,1 bar | 319.39 | J/mol*K | Review | Chase, 1998 | Data last reviewed in June, 1975 |
Gas Phase Heat Capacity (Shomate Equation)
Cp° = A + B*t + C*t2 + D*t3 +
E/t2
H° − H°298.15= A*t + B*t2/2 +
C*t3/3 + D*t4/4 − E/t + F − H
S° = A*ln(t) + B*t + C*t2/2 + D*t3/3 −
E/(2*t2) + G
Cp = heat capacity (J/mol*K)
H° = standard enthalpy (kJ/mol)
S° = standard entropy (J/mol*K)
t = temperature (K) / 1000.
View plot Requires a JavaScript / HTML 5 canvas capable browser.
Temperature (K) | 298. to 6000. |
---|---|
A | 104.4167 |
B | 3.106352 |
C | -0.837700 |
D | 0.071272 |
E | -1.639702 |
F | -1710.361 |
G | 435.6381 |
H | -1673.600 |
Reference | Chase, 1998 |
Comment | Data last reviewed in June, 1975 |

Reaction thermochemistry data

Data compiled by: John E. Bartmess
Individual Reactions
By formula: F- + F4Zr = (F- • F4Zr)
Quantity | Value | Units | Method | Reference | Comment |
---|---|---|---|---|---|
ΔrH° | 415. ± 8.4 | kJ/mol | TDEq | Skokan, Sorokin, et al., 1982 | gas phase; Fluoride Affinity: 22±1 kcal < AlF3; value altered from reference due to conversion from electron convention to ion convention |
ΔrH° | 403. ± 4.2 | kJ/mol | TDEq | Skokan, Nikitin, et al., 1981 | gas phase; Fluoride Affinity: 23.12 kcal < AlF3; value altered from reference due to conversion from electron convention to ion convention |
By formula: F5Zr- + F4Zr = F9Zr2-
Quantity | Value | Units | Method | Reference | Comment |
---|---|---|---|---|---|
ΔrH° | 214. ± 4.2 | kJ/mol | TDAs | Skokan, Sorokin, et al., 1982 | gas phase; value altered from reference due to conversion from electron convention to ion convention |

References

Chase, 1998
Chase, M.W., Jr.,
NIST-JANAF Themochemical Tables, Fourth Edition,
J. Phys. Chem. Ref. Data, Monograph 9, 1998, 1-1951. [all data]
Skokan, Sorokin, et al., 1982
Skokan, E.V.; Sorokin, I.D.; Sidorov, L.N.; Nikitin, M.I.,
Mass Spectrometric Determination of the Enthalpies of Dissociation of Gaseous Complex Fluorides into Neutral and Charged Particles. VI. Enthalpy of Formation of ZrF5-,
Int. J. Mass Spectrom. Ion Phys., 1982, 43, 4, 209, https://doi.org/10.1016/0020-7381(82)80017-X
. [all data]
Skokan, Nikitin, et al., 1981
Skokan, E.V.; Nikitin, M.I.; Sorokin, I.D.; Gusarov, A.V.; Sidirov, L.N.,
Determination of the heat of formation of the tetrafluoroscandate and pentfluorozirconate ions by the effusion nethod,
Russ. J. Phys. Chem., 1981, 55, 1062. [all data]