titanium tetrafluoride
- Formula: F4Ti
- Molecular weight: 123.861
- IUPAC Standard InChIKey: XROWMBWRMNHXMF-UHFFFAOYSA-J
- CAS Registry Number: 7783-63-3
- Chemical structure:

Gas phase thermochemistry data

Quantity | Value | Units | Method | Reference | Comment |
---|---|---|---|---|---|
ΔfH°gas | -370.801 | kcal/mol | Review | Chase, 1998 | Data last reviewed in September, 1967 |
Quantity | Value | Units | Method | Reference | Comment |
S°gas,1 bar | 75.229 | cal/mol*K | Review | Chase, 1998 | Data last reviewed in September, 1967 |
Gas Phase Heat Capacity (Shomate Equation)
Cp° = A + B*t + C*t2 + D*t3 +
E/t2
H° − H°298.15= A*t + B*t2/2 +
C*t3/3 + D*t4/4 − E/t + F − H
S° = A*ln(t) + B*t + C*t2/2 + D*t3/3 −
E/(2*t2) + G
Cp = heat capacity (cal/mol*K)
H° = standard enthalpy (kcal/mol)
S° = standard entropy (cal/mol*K)
t = temperature (K) / 1000.
View plot Requires a JavaScript / HTML 5 canvas capable browser.
Temperature (K) | 298. to 6000. |
---|---|
A | 24.59479 |
B | 1.043651 |
C | -0.280752 |
D | 0.023850 |
E | -0.418378 |
F | -379.5801 |
G | 102.3400 |
H | -370.8000 |
Reference | Chase, 1998 |
Comment | Data last reviewed in September, 1967 |

Condensed phase thermochemistry data

Quantity | Value | Units | Method | Reference | Comment |
---|---|---|---|---|---|
ΔfH°solid | -394.202 | kcal/mol | Review | Chase, 1998 | Data last reviewed in September, 1967 |
Quantity | Value | Units | Method | Reference | Comment |
S°solid | 31.996 | cal/mol*K | Review | Chase, 1998 | Data last reviewed in September, 1967 |
Solid Phase Heat Capacity (Shomate Equation)
Cp° = A + B*t + C*t2 + D*t3 +
E/t2
H° − H°298.15= A*t + B*t2/2 +
C*t3/3 + D*t4/4 − E/t + F − H
S° = A*ln(t) + B*t + C*t2/2 + D*t3/3 −
E/(2*t2) + G
Cp = heat capacity (cal/mol*K)
H° = standard enthalpy (kcal/mol)
S° = standard entropy (cal/mol*K)
t = temperature (K) / 1000.
View plot Requires a JavaScript / HTML 5 canvas capable browser.
Temperature (K) | 298. to 1500. |
---|---|
A | 26.15251 |
B | 20.70290 |
C | -13.53070 |
D | 3.288961 |
E | -0.346841 |
F | -403.9749 |
G | 56.09431 |
H | -394.2010 |
Reference | Chase, 1998 |
Comment | Data last reviewed in September, 1967 |

Reaction thermochemistry data

Data compiled by: John E. Bartmess
Individual Reactions
By formula: F- + F4Ti = (F- • F4Ti)
Quantity | Value | Units | Method | Reference | Comment |
---|---|---|---|---|---|
ΔrH° | 86.3 ± 3.8 | kcal/mol | TDAs | Boltalina, Borshchevskii, et al., 1992 | gas phase; Critical review; value altered from reference due to conversion from electron convention to ion convention |
ΔrH° | 86.0 ± 5.3 | kcal/mol | TDEq | Boltalina, Borshchevskii, et al., 1991 | gas phase; Fluoride Affinity: 30.3 kcal/mol < AlF3 (Data at 0 K); value altered from reference due to conversion from electron convention to ion convention |

Gas phase ion energetics data

Data compiled by: John E. Bartmess
Electron affinity determinations
EA (eV) | Method | Reference | Comment |
---|---|---|---|
2.50 ± 0.22 | R-A | Boltalina, Borshchevskii, et al., 1991 | value altered from reference due to conversion from electron convention to ion convention |

Ion clustering data

Data compiled by: John E. Bartmess
Clustering reactions
By formula: F- + F4Ti = (F- • F4Ti)
Quantity | Value | Units | Method | Reference | Comment |
---|---|---|---|---|---|
ΔrH° | 86.3 ± 3.8 | kcal/mol | TDAs | Boltalina, Borshchevskii, et al., 1992 | gas phase; Critical review; value altered from reference due to conversion from electron convention to ion convention |
ΔrH° | 86.0 ± 5.3 | kcal/mol | TDEq | Boltalina, Borshchevskii, et al., 1991 | gas phase; Fluoride Affinity: 30.3 kcal/mol < AlF3 (Data at 0 K); value altered from reference due to conversion from electron convention to ion convention |

References

Chase, 1998
Chase, M.W., Jr.,
NIST-JANAF Themochemical Tables, Fourth Edition,
J. Phys. Chem. Ref. Data, Monograph 9, 1998, 1-1951. [all data]
Boltalina, Borshchevskii, et al., 1992
Boltalina, O.V.; Borshchevskii, A.Y.; Sidorov, L.N.,
Thermochemistry of 3d Elements Fluorides and Their Negative Ions in Gas Phase,
Russ. J. Phys. Chem., 1992, 66, 1223. [all data]
Boltalina, Borshchevskii, et al., 1991
Boltalina, O.V.; Borshchevskii, A.Y.; Sidorov, L.N.; Chepurnykh, V.N.,
Enthalpy of the Formation of TiF5- Anion in a Gas Phase,
Zh. Fiz. Khim. SSSR, 1991, 65, 928. [all data]