Perfluoroperoxide
- Formula: F2O2
- Molecular weight: 69.9956
- IUPAC Standard InChIKey: REAOZOPEJGPVCB-UHFFFAOYSA-N
- CAS Registry Number: 7783-44-0
- Chemical structure:
View 3d structure (requires JavaScript / HTML 5) - Permanent link for this species. Use this link for bookmarking this species for future reference.

Phase change data

Data compiled by: Thermodynamics Research Center, NIST Boulder Laboratories, Chris Muzny director
Quantity | Value | Units | Method | Reference | Comment |
---|---|---|---|---|---|
Tboil | 216. | K | N/A | Streng, 1971 | Uncertainty assigned by TRC = 2. K; with decomposition |
Quantity | Value | Units | Method | Reference | Comment |
Tfus | 109.7 | K | N/A | Streng, 1971 | Uncertainty assigned by TRC = 0.4 K |

References

Streng, 1971
Streng, A.G.,
Miscibility and Compatibility of Some Liquid and Solidified Gases at Low Temperature,
J. Chem. Eng. Data, 1971, 16, 357. [all data]