mercury iodide
- Formula: HgI
- Molecular weight: 327.49
- IUPAC Standard InChIKey: QKEOZZYXWAIQFO-UHFFFAOYSA-M
- CAS Registry Number: 7783-30-4
- Chemical structure:
View 3d structure (requires JavaScript / HTML 5) - Permanent link for this species. Use this link for bookmarking this species for future reference.

Gas phase thermochemistry data

Quantity | Value | Units | Method | Reference | Comment |
---|---|---|---|---|---|
ΔfH°gas | 133.47 | kJ/mol | Review | Chase, 1998 | Data last reviewed in December, 1961 |
Quantity | Value | Units | Method | Reference | Comment |
S°gas,1 bar | 280.75 | J/mol*K | Review | Chase, 1998 | Data last reviewed in December, 1961 |
Gas Phase Heat Capacity (Shomate Equation)
Cp° = A + B*t + C*t2 + D*t3 +
E/t2
H° − H°298.15= A*t + B*t2/2 +
C*t3/3 + D*t4/4 − E/t + F − H
S° = A*ln(t) + B*t + C*t2/2 + D*t3/3 −
E/(2*t2) + G
Cp = heat capacity (J/mol*K)
H° = standard enthalpy (kJ/mol)
S° = standard entropy (J/mol*K)
t = temperature (K) / 1000.
View plot Requires a JavaScript / HTML 5 canvas capable browser.
Temperature (K) | 298. to 6000. |
---|---|
A | 37.41341 |
B | 2.518597 |
C | -0.000234 |
D | 0.000019 |
E | -0.021861 |
F | 122.1301 |
G | 325.1541 |
H | 133.4700 |
Reference | Chase, 1998 |
Comment | Data last reviewed in December, 1961 |

Constants of diatomic molecules

Data compiled by: Klaus P. Huber and Gerhard H. Herzberg

Data collected through February, 1975

Symbols used in the table of constants
SymbolMeaning
State electronic state and / or symmetry symbol
Te minimum electronic energy (cm-1)
ωe vibrational constant – first term (cm-1)
ωexe vibrational constant – second term (cm-1)
ωeye vibrational constant – third term (cm-1)
Be rotational constant in equilibrium position (cm-1)
αe rotational constant – first term (cm-1)
γe rotation-vibration interaction constant (cm-1)
De centrifugal distortion constant (cm-1)
βe rotational constant – first term, centrifugal force (cm-1)
re internuclear distance (Å)
Trans. observed transition(s) corresponding to electronic state
ν00 position of 0-0 band (units noted in table)
Diatomic constants for (202)Hg127I
StateTeωeωexeωeyeBeαeγeDeβereTrans.ν00
H 47110 97.1 H 1.7 1        H → X R 47096 H
Prileshajewa, 1932; missing citation
G 45542 88.4 H 0.2        G → X R 45524 H
Prileshajewa, 1932; missing citation
F3 (44531) (85.5) H (0.8)        F3 → X R (44510) H
Rao and Rao, 1946; Ramasastry, 1948
F2 2           F2 → X R
Rao and Rao, 1946; missing citation
StateTeωeωexeωeyeBeαeγeDeβereTrans.ν00
F1 40152 90.8 H 0.93        F1 → X R 40135 H
Rao and Rao, 1946; Ramasastry, 1948
E 3           E → X R
Wieland, 1932; Sastry, 1942; Krishnamurthi, 1960
D (2Π3/2) 36269 178.0 H 1.14        D → X V 36295 H
Wieland, 1932; Howell, 1944; Rao, Sastry, et al., 1944
C (2Π1/2) 32730.0 235.6 H 2.21        C ↔ X V 32785.0 H
Wieland, 1929; Wieland, 1932; Howell, 1944; Rao, Sastry, et al., 1944; Wieland, 1948; Wieland and Herczog, 1949; Greig, Gunning, et al., 1970
StateTeωeωexeωeyeBeαeγeDeβereTrans.ν00
B 2Σ+ 24187.1 110.45 H 0.15        B ↔ X R 24180.0 H
Wieland, 1948, 2; missing citation
X 2Σ+ 0 125.0 H 1.0 4

References

Chase, 1998
Chase, M.W., Jr.,
NIST-JANAF Themochemical Tables, Fourth Edition,
J. Phys. Chem. Ref. Data, Monograph 9, 1998, 1-1951. [all data]