molybdic acid
- Formula: H2MoO4
- Molecular weight: 161.97
- IUPAC Standard InChIKey: VLAPMBHFAWRUQP-UHFFFAOYSA-L
- CAS Registry Number: 7782-91-4
- Chemical structure:
View 3d structure (requires JavaScript / HTML 5) - Permanent link for this species. Use this link for bookmarking this species for future reference.

Gas phase thermochemistry data

Quantity | Value | Units | Method | Reference | Comment |
---|---|---|---|---|---|
ΔfH°gas | -851.03 | kJ/mol | Review | Chase, 1998 | Data last reviewed in June, 1970 |
Quantity | Value | Units | Method | Reference | Comment |
S°gas,1 bar | 355.61 | J/mol*K | Review | Chase, 1998 | Data last reviewed in June, 1970 |
Gas Phase Heat Capacity (Shomate Equation)
Cp° = A + B*t + C*t2 + D*t3 +
E/t2
H° − H°298.15= A*t + B*t2/2 +
C*t3/3 + D*t4/4 − E/t + F − H
S° = A*ln(t) + B*t + C*t2/2 + D*t3/3 −
E/(2*t2) + G
Cp = heat capacity (J/mol*K)
H° = standard enthalpy (kJ/mol)
S° = standard entropy (J/mol*K)
t = temperature (K) / 1000.
View plot Requires a JavaScript / HTML 5 canvas capable browser.
Temperature (K) | 298. to 1200. | 1200. to 6000. |
---|---|---|
A | 82.83651 | 146.9927 |
B | 129.6584 | 5.596645 |
C | -99.71727 | -1.059557 |
D | 29.18097 | 0.069833 |
E | -0.826093 | -11.19848 |
F | -883.4390 | -921.4842 |
G | 416.7235 | 496.0299 |
H | -851.0256 | -851.0256 |
Reference | Chase, 1998 | Chase, 1998 |
Comment | Data last reviewed in June, 1970 | Data last reviewed in June, 1970 |

Gas phase ion energetics data

Data compiled by: John E. Bartmess
De-protonation reactions
HMoO4- + =
By formula: HMoO4- + H+ = H2MoO4
Quantity | Value | Units | Method | Reference | Comment |
---|---|---|---|---|---|
ΔrH° | 1362. ± 40. | kJ/mol | TDEq | Miller, 1979 | gas phase; e- + H2MoO4 <=> HMoO4- + H |

Reaction thermochemistry data

Data compiled by: John E. Bartmess
Individual Reactions
HMoO4- + =
By formula: HMoO4- + H+ = H2MoO4
Quantity | Value | Units | Method | Reference | Comment |
---|---|---|---|---|---|
ΔrH° | 325.6 ± 9.6 | kcal/mol | TDEq | Miller, 1979 | gas phase; e- + H2MoO4 <=> HMoO4- + H |

References

Chase, 1998
Chase, M.W., Jr.,
NIST-JANAF Themochemical Tables, Fourth Edition,
J. Phys. Chem. Ref. Data, Monograph 9, 1998, 1-1951. [all data]