Chlorine
- Formula: Cl2
- Molecular weight: 70.906
- IUPAC Standard InChIKey: KZBUYRJDOAKODT-UHFFFAOYSA-N
- CAS Registry Number: 7782-50-5
- Chemical structure:
View 3d structure (requires JavaScript / HTML 5) - Other names: Cl2; Bertholite; Chloor; Chlor; Chlore; Chlorine mol.; Cloro; Molecular chlorine; UN 1017; Diatomic chlorine

Constants of diatomic molecules

Data compiled by: Klaus P. Huber and Gerhard H. Herzberg
Data collected through September, 1976
Symbol | Meaning |
---|---|
State | electronic state and / or symmetry symbol |
Te | minimum electronic energy (cm-1) |
ωe | vibrational constant – first term (cm-1) |
ωexe | vibrational constant – second term (cm-1) |
ωeye | vibrational constant – third term (cm-1) |
Be | rotational constant in equilibrium position (cm-1) |
αe | rotational constant – first term (cm-1) |
γe | rotation-vibration interaction constant (cm-1) |
De | centrifugal distortion constant (cm-1) |
βe | rotational constant – first term, centrifugal force (cm-1) |
re | internuclear distance (Å) |
Trans. | observed transition(s) corresponding to electronic state |
ν00 | position of 0-0 band (units noted in table) |
State | Te | ωe | ωexe | ωeye | Be | αe | γe | De | βe | re | Trans. | ν00 |
---|---|---|---|---|---|---|---|---|---|---|---|---|
Rydberg series joining on to P: v(1-0) = 93200 - R / (n-0.54)2, n = 3...7; fragmentary vibrational structure. | ||||||||||||
↳Iczkowski, Margrave, et al., 1960 | ||||||||||||
Fragments of additional band systems in absorption at v > 65000 cm-1. | ||||||||||||
↳Lee and Walsh, 1959; Iczkowski, Margrave, et al., 1960 | ||||||||||||
Emission continua in the ultraviolet with maxima at 32640, 33810, 34700, 35450, 36220, 36820, 38970, 41140, 42500, 43710, 45500, 46610, 47670; 50060, 51850, 53890 cm-1. 1 | ||||||||||||
↳Asundi and Venkateswarlu, 1947 | ||||||||||||
P | (74405) | (621) | (3) | P ← X | 74436 | |||||||
↳Lee and Walsh, 1959; Iczkowski, Margrave, et al., 1960 | ||||||||||||
State | Te | ωe | ωexe | ωeye | Be | αe | γe | De | βe | re | Trans. | ν00 |
O | [0.1840] 2 | O → X R | 74018.5 2 Z | |||||||||
↳missing citation | ||||||||||||
N | [0.1193] 2 | N → X R | 73363.3 2 Z | |||||||||
↳missing citation | ||||||||||||
M | (72853) | (636) | (4) | M ← X | 72891 | |||||||
↳Lee and Walsh, 1959 | ||||||||||||
K | (64024) | (460) | K → X 3 | 63975 | ||||||||
↳Haranath and Rao, 1958 | ||||||||||||
State | Te | ωe | ωexe | ωeye | Be | αe | γe | De | βe | re | Trans. | ν00 |
J | (61638) | (520) | (3) | J ← X | 61618 | |||||||
↳Lee and Walsh, 1959 | ||||||||||||
I | 61438 | 262.3 H | 0.812 | I → B V | 43632 H | |||||||
↳Khanna, 1959 | ||||||||||||
H | (59432) | (510) | H ← X | 59408 | ||||||||
↳Lee and Walsh, 1959 | ||||||||||||
G | (58629) | (208) | G → X 3 R | 58454 | ||||||||
↳Haranath and Rao, 1958 | ||||||||||||
State | Te | ωe | ωexe | ωeye | Be | αe | γe | De | βe | re | Trans. | ν00 |
F | (58263) | (442) | F ← X | 58205 | ||||||||
↳Lee and Walsh, 1959 | ||||||||||||
E | 57953 | 249.75 H | 0.875 | E ↔ B R | 40140.0 H | |||||||
↳Venkateswarlu and Khanna, 1959; missing citation; Wieland, Tellinghuisen, et al., 1972 | ||||||||||||
D | (53568) | (440) | (1.5) | D ← X | 53508 | |||||||
↳Lee and Walsh, 1959 | ||||||||||||
4 | ||||||||||||
↳Cordes and Sponer, 1930; Lee and Walsh, 1959 | ||||||||||||
State | Te | ωe | ωexe | ωeye | Be | αe | γe | De | βe | re | Trans. | ν00 |
C 1Πu | 5 | C ↔ X 6 | ||||||||||
↳Gibson and Bayliss, 1933; Sulzer and Wieland, 1952; Jacobs and Giedt, 1965; Clyne and Stedman, 1968; Palmer and Carabetta, 1968 | ||||||||||||
B 3Π0+u | 17809 | 259.5 7 H | 5.3 8 | 0.16256 9 | 0.00212 | -0.000091 | 2.365E-7 10 | 2.4354 | B ↔ X 11 12 R | 17658 7 H | ||
↳missing citation; missing citation; missing citation | ||||||||||||
A (3Π1u) | (17440) | (265) H | (5) | A → X 11 13 | ||||||||
↳Coxon, 1973 | ||||||||||||
A' (3Π2u) | (17160) 14 | (280) 15 | A' → X 16 | |||||||||
↳Bondybey and Fletcher, 1976 | ||||||||||||
State | Te | ωe | ωexe | ωeye | Be | αe | γe | De | βe | re | Trans. | ν00 |
X 1Σg+ | 0 | 559.72 17 18 | 2.675 | -0.0067 | 0.24399 17 | 0.00149 | -0.0000017 | 1.86E-7 | 1.9879 19 | |||
↳Winkel, Hunt, et al., 1969 | ||||||||||||
Raman sp. | ||||||||||||
↳Holzer, Murphy, et al., 1970; Hochenbleicher and Schrotter, 1971; Hendra and Vear, 1972; Wallart, 1972; Edwards, Good, et al., 1976 |

Gas phase thermochemistry data

Quantity | Value | Units | Method | Reference | Comment |
---|---|---|---|---|---|
S°gas,1 bar | 223.081 ± 0.010 | J/mol*K | Review | Cox, Wagman, et al., 1984 | CODATA Review value |
S°gas,1 bar | 223.08 | J/mol*K | Review | Chase, 1998 | Data last reviewed in June, 1982 |
Gas Phase Heat Capacity (Shomate Equation)
Cp° = A + B*t + C*t2 + D*t3 +
E/t2
H° − H°298.15= A*t + B*t2/2 +
C*t3/3 + D*t4/4 − E/t + F − H
S° = A*ln(t) + B*t + C*t2/2 + D*t3/3 −
E/(2*t2) + G
Cp = heat capacity (J/mol*K)
H° = standard enthalpy (kJ/mol)
S° = standard entropy (J/mol*K)
t = temperature (K) / 1000.
View plot Requires a JavaScript / HTML 5 canvas capable browser.
Temperature (K) | 298. to 1000. | 1000. to 3000. | 3000. to 6000. |
---|---|---|---|
A | 33.05060 | 42.67730 | -42.55350 |
B | 12.22940 | -5.009570 | 41.68570 |
C | -12.06510 | 1.904621 | -7.126830 |
D | 4.385330 | -0.165641 | 0.387839 |
E | -0.159494 | -2.098480 | 101.1440 |
F | -10.83480 | -17.28980 | 132.7640 |
G | 259.0290 | 269.8400 | 264.7860 |
H | 0.000000 | 0.000000 | 0.000000 |
Reference | Chase, 1998 | Chase, 1998 | Chase, 1998 |
Comment | Data last reviewed in June, 1982 | Data last reviewed in June, 1982 | Data last reviewed in June, 1982 |

Reaction thermochemistry data

Data compiled as indicated in comments:
B - John E. Bartmess
ALS - Hussein Y. Afeefy, Joel F. Liebman, and Stephen E. Stein
M - Michael M. Meot-Ner (Mautner) and Sharon G. Lias
Individual Reactions
+
= Cl3-
Quantity | Value | Units | Method | Reference | Comment |
---|---|---|---|---|---|
ΔrH° | 99.2 ± 5.0 | kJ/mol | CIDT | Nizzi, Pommerening, et al., 1998 | gas phase; B |
ΔrH° | 69.87 | kJ/mol | Ther | Robbiani and Franklin, 1979 | gas phase; ΔG≈+1 kcal for Cl- + SO2Cl2 <=> Cl3- + SO2; B |
ΔrH° | <182.4 | kJ/mol | PDis | Lee, Smith, et al., 1979 | gas phase; B |
By formula: C2Cl4 + Cl2 = C2Cl6
Quantity | Value | Units | Method | Reference | Comment |
---|---|---|---|---|---|
ΔrH° | -153.6 ± 2.5 | kJ/mol | Cm | Kirkbride, 1956 | liquid phase; Reanalyzed by Cox and Pilcher, 1970, Original value = -150. kJ/mol; ALS |
By formula: Cl- + Cl2 = (Cl- • Cl2)
Quantity | Value | Units | Method | Reference | Comment |
---|---|---|---|---|---|
ΔrH° | 71.1 | kJ/mol | SAMS | Robbiani and Franklin, 1979, 2 | gas phase; based on Cl- + SO2Cl2 <--> Cl3- + SO2; National Bureau of Standards, 1968; M |
By formula: C4F6 + Cl2 = C4Cl2F6
Quantity | Value | Units | Method | Reference | Comment |
---|---|---|---|---|---|
ΔrH° | -156.4 ± 4.1 | kJ/mol | Cm | Lacher, McKinley, et al., 1949 | gas phase; Heat of chlorination at 363 °K; ALS |
By formula: C3F6 + Cl2 = C3Cl2F6
Quantity | Value | Units | Method | Reference | Comment |
---|---|---|---|---|---|
ΔrH° | -197.27 ± 0.48 | kJ/mol | Cm | Lacher, McKinley, et al., 1949 | gas phase; Heat of chlorination at 363 °K; ALS |
By formula: Cl2 + C2ClF3 = C2Cl3F3
Quantity | Value | Units | Method | Reference | Comment |
---|---|---|---|---|---|
ΔrH° | -204.2 ± 2.0 | kJ/mol | Cm | Lacher, McKinley, et al., 1949 | gas phase; Heat of Chlorination at 363 °K; ALS |
By formula: Cl2 + C2Cl2F2 = C2Cl4F2
Quantity | Value | Units | Method | Reference | Comment |
---|---|---|---|---|---|
ΔrH° | -171.9 ± 2.3 | kJ/mol | Cm | Lacher, McKinley, et al., 1949 | gas phase; Heat of chlorination at 363 °K; ALS |
By formula: C2F4 + Cl2 = C2Cl2F4
Quantity | Value | Units | Method | Reference | Comment |
---|---|---|---|---|---|
ΔrH° | -239.84 ± 0.84 | kJ/mol | Cm | Lacher, McKinley, et al., 1949, 2 | gas phase; Chlorination at 90 C; ALS |
By formula: C2H4Cl2 + Cl2 = HCl + C2H3Cl3
Quantity | Value | Units | Method | Reference | Comment |
---|---|---|---|---|---|
ΔrH° | -116. | kJ/mol | Cm | Kirkbride, 1956 | liquid phase; Heat of chlorination; ALS |
By formula: CHCl3 + Cl2 = CCl4 + HCl
Quantity | Value | Units | Method | Reference | Comment |
---|---|---|---|---|---|
ΔrH° | -93.30 | kJ/mol | Cm | Kirkbride, 1956 | liquid phase; Heat of chlorination; ALS |
By formula: C2H4 + Cl2 = C2H4Cl2
Quantity | Value | Units | Method | Reference | Comment |
---|---|---|---|---|---|
ΔrH° | -182.6 ± 0.63 | kJ/mol | Cm | Conn, Kistiakowsky, et al., 1938 | gas phase; At 355 °K; ALS |
By formula: C2H2Cl2 + Cl2 = C2H2Cl4
Quantity | Value | Units | Method | Reference | Comment |
---|---|---|---|---|---|
ΔrH° | -169. | kJ/mol | Cm | Kirkbride, 1956 | liquid phase; Heat of chlorination; ALS |
By formula: BrCl + CClF3 = CBrF3 + Cl2
Quantity | Value | Units | Method | Reference | Comment |
---|---|---|---|---|---|
ΔrH° | 44.73 ± 0.63 | kJ/mol | Eqk | Coomber and Whittle, 1967 | gas phase; ALS |
+
= C2BrF5 +
By formula: BrCl + C2ClF5 = C2BrF5 + Cl2
Quantity | Value | Units | Method | Reference | Comment |
---|---|---|---|---|---|
ΔrH° | 43. ± 3. | kJ/mol | Eqk | Coomber and Whittle, 1967 | gas phase; ALS |
By formula: C2H2Cl2 = C2H2 + Cl2
Quantity | Value | Units | Method | Reference | Comment |
---|---|---|---|---|---|
ΔrH° | 21. | kJ/mol | Kin | Laursen and Pimentel, 1989 | gas phase; Photolyses; ALS |
By formula: C4F8 + Cl2 = C4Cl2F8
Quantity | Value | Units | Method | Reference | Comment |
---|---|---|---|---|---|
ΔrH° | -188.2 ± 1.3 | kJ/mol | Cm | Lacher, Kianpour, et al., 1957 | gas phase; ALS |
By formula: C5F10 + Cl2 = C5Cl2F10
Quantity | Value | Units | Method | Reference | Comment |
---|---|---|---|---|---|
ΔrH° | -190.8 ± 1.7 | kJ/mol | Cm | Lacher, Kianpour, et al., 1957, 2 | gas phase; ALS |
By formula: C2Cl6 = C2Cl4 + Cl2
Quantity | Value | Units | Method | Reference | Comment |
---|---|---|---|---|---|
ΔrH° | 132.6 ± 4.2 | kJ/mol | Eqk | Puyo, Balesdent, et al., 1963 | gas phase; ALS |
By formula: C4F8 + Cl2 = C4Cl2F8
Quantity | Value | Units | Method | Reference | Comment |
---|---|---|---|---|---|
ΔrH° | -176.6 ± 2.1 | kJ/mol | Cm | Lacher, Kianpour, et al., 1957, 2 | gas phase; ALS |
By formula: C6H11Cl + HCl = C6H12 + Cl2
Quantity | Value | Units | Method | Reference | Comment |
---|---|---|---|---|---|
ΔrH° | -143.1 | kJ/mol | Cm | Kirkbride, 1956 | liquid phase; ALS |
By formula: C6H6 + Cl2 = C6H5Cl + HCl
Quantity | Value | Units | Method | Reference | Comment |
---|---|---|---|---|---|
ΔrH° | -134. | kJ/mol | Cm | Kirkbride, 1956 | liquid phase; ALS |
By formula: Cl2 + C2HCl3 = C2HCl5
Quantity | Value | Units | Method | Reference | Comment |
---|---|---|---|---|---|
ΔrH° | -151. | kJ/mol | Cm | Kirkbride, 1956 | liquid phase; ALS |

Henry's Law data

Data compiled by: Rolf Sander
Henry's Law constant (water solution)
kH(T) = k°H exp(d(ln(kH))/d(1/T) ((1/T) - 1/(298.15 K)))
k°H = Henry's law constant for solubility in water at 298.15 K (mol/(kg*bar))
d(ln(kH))/d(1/T) = Temperature dependence constant (K)
k°H (mol/(kg*bar)) | d(ln(kH))/d(1/T) (K) | Method | Reference | Comment |
---|---|---|---|---|
0.095 | 2100. | L | N/A | |
0.093 | 2600. | Q | N/A | Only the tabulated data between T = 273. K and T = 303. K from missing citation was used to derive kH and -Δ kH/R. Above T = 303. K the tabulated data could not be parameterized by equation (reference missing) very well. The partial pressure of water vapor (needed to convert some Henry's law constants) was calculated using the formula given by missing citation. The quantities A and α from missing citation were assumed to be identical. |
0.061 | 2800. | T | N/A | |
0.085 | 2000. | X | N/A | |
0.091 | 2500. | L | N/A | |
0.062 | 3200. | L | N/A |

Phase change data

Data compiled as indicated in comments:
TRC - Thermodynamics Research Center, NIST Boulder Laboratories, Chris Muzny director
Quantity | Value | Units | Method | Reference | Comment |
---|---|---|---|---|---|
Tboil | 239.5 | K | N/A | Thiele and Schulte, 1920 | Uncertainty assigned by TRC = 0.6 K; TRC |
Quantity | Value | Units | Method | Reference | Comment |
Ttriple | 172.17 ± 0.05 | K | N/A | Angus, Armstrong, et al., 1984 | Uncertainty assigned by TRC = 0.05 K; TRC |
Ttriple | 172.12 | K | N/A | Giauque and Powell, 1939 | Uncertainty assigned by TRC = 0.15 K; mean of 5 measurements with thermocouple and Pt res. therm., To = 273.10 K; TRC |
Quantity | Value | Units | Method | Reference | Comment |
Ptriple | 0.01392 ± 0.00003 | bar | N/A | Angus, Armstrong, et al., 1984 | Uncertainty assigned by TRC = 0.00003 bar; TRC |
Quantity | Value | Units | Method | Reference | Comment |
Tc | 416.956 | K | N/A | Angus, Armstrong, et al., 1984 | TRC |
Tc | 416.9 | K | N/A | Ambrose, Hall, et al., 1979 | Uncertainty assigned by TRC = 0.5 K; TRC |
Quantity | Value | Units | Method | Reference | Comment |
Pc | 79.914 | bar | N/A | Angus, Armstrong, et al., 1984 | TRC |
Pc | 79.77 | bar | N/A | Ambrose, Hall, et al., 1979 | Uncertainty assigned by TRC = 0.50 bar; Visual, uncertain because of reactivity of element.; TRC |
Quantity | Value | Units | Method | Reference | Comment |
ρc | 8.1344 | mol/l | N/A | Angus, Armstrong, et al., 1984 | TRC |
Antoine Equation Parameters
log10(P) = A − (B / (T + C))
P = vapor pressure (bar)
T = temperature (K)
View plot Requires a JavaScript / HTML 5 canvas capable browser.
Temperature (K) | A | B | C | Reference | Comment |
---|---|---|---|---|---|
155. to 239.4 | 3.0213 | 530.591 | -64.639 | Stull, 1947 | Coefficents calculated by NIST from author's data. |
239.4 to 400.3 | 4.28814 | 969.992 | -12.791 | Stull, 1947 | Coefficents calculated by NIST from author's data. |

Ion clustering data

Data compiled as indicated in comments:
M - Michael M. Meot-Ner (Mautner) and Sharon G. Lias
B - John E. Bartmess
Clustering reactions
By formula: Cl- + Cl2 = (Cl- • Cl2)
Quantity | Value | Units | Method | Reference | Comment |
---|---|---|---|---|---|
ΔrH° | 71.1 | kJ/mol | SAMS | Robbiani and Franklin, 1979 | gas phase; based on Cl- + SO2Cl2 <--> Cl3- + SO2; National Bureau of Standards, 1968; M |
+
= Cl3-
Quantity | Value | Units | Method | Reference | Comment |
---|---|---|---|---|---|
ΔrH° | 99.2 ± 5.0 | kJ/mol | CIDT | Nizzi, Pommerening, et al., 1998 | gas phase; B |
ΔrH° | 69.87 | kJ/mol | Ther | Robbiani and Franklin, 1979, 2 | gas phase; ΔG≈+1 kcal for Cl- + SO2Cl2 <=> Cl3- + SO2; B |
ΔrH° | <182.4 | kJ/mol | PDis | Lee, Smith, et al., 1979 | gas phase; B |

Gas phase ion energetics data

Data compiled as indicated in comments:
LL - Sharon G. Lias and Joel F. Liebman
LBLHLM - Sharon G. Lias, John E. Bartmess, Joel F. Liebman, John L. Holmes, Rhoda D. Levin, and W. Gary Mallard
LLK - Sharon G. Lias, Rhoda D. Levin, and Sherif A. Kafafi
RDSH - Henry M. Rosenstock, Keith Draxl, Bruce W. Steiner, and John T. Herron
B - John E. Bartmess

Electron affinity determinations

EA (eV) Method Reference Comment
2.50 ± 0.20NBIEBowen, Liesegang, et al., 1983B
2.33004ECDAyala, Wentworth, et al., 1981Vertical Detachment Energy: 1.02 eV; B
2.40 ± 0.20NBIEDispert and Lacmann, 1977B
2.32 ± 0.10EndoHughes, Lifschitz, et al., 1973B
2.45 ± 0.15NBIEBaeda, 1972B
2.46 ± 0.14IMRBDunkin, Fehsenfeld, et al., 1972B
2.38 ± 0.10EndoChupka, Berkowitz, et al., 1971B
2.52 ± 0.17EIAEDeCorpo and Franklin, 1971From CCl4; B
1.020 ± 0.050NBIEHubers, Kleyn, et al., 1976Stated electron affinity is the Vertical Detachment Energy; B
3.20 ± 0.20NBIELacmann and Herschbach, 1970B

Ionization energy determinations

IE (eV) Method Reference Comment
11.481 ± 0.003TEYencha, Hopkirk, et al., 1995LL
11.480 ± 0.005PEVan Lonkhuyzen and De Lange, 1984LBLHLM
11.50EVALHuber and Herzberg, 1979LLK
11.51 ± 0.01PEPotts and Price, 1971LLK
11.48 ± 0.01PIDibeler, Walker, et al., 1971LLK
11.49PECornford, Frost, et al., 1971LLK
11.49PEAnderson, Mamantov, et al., 1971LLK
11.48 ± 0.01PIWatanabe, 1957RDSH
11.49PEDyke, Josland, et al., 1984Vertical value; LBLHLM
11.59PEKimura, Katsumata, et al., 1981Vertical value; LLK

Appearance energy determinations

Ion AE (eV) Other Products MethodReferenceComment
Cl+11.86 ± 0.04Cl-EIFrost and McDowell, 1959RDSH

References

Iczkowski, Margrave, et al., 1960
Iczkowski, R.P.; Margrave, J.L.; Green, J.W.,
Absorption spectrum of chlorine in the vacuum ultraviolet,
J. Chem. Phys., 1960, 33, 1261. [all data]
Lee and Walsh, 1959
Lee, J.; Walsh, A.D.,
The vacuum ultra-violet absorption spectra of the halogen molecules,
Trans. Faraday Soc., 1959, 55, 1281. [all data]
Asundi and Venkateswarlu, 1947
Asundi, R.K.; Venkateswarlu, P.,
Spectra of the Halogens, I2, Br2 and Cl2,
Indian J. Phys., 1947, 21, 101-118. [all data]
Haranath and Rao, 1958
Haranath, P.B.V.; Rao, P.T.,
Band spectra of iodine, chlorine, and bromine in the spectral region 2400-1400 A,
J. Mol. Spectrosc., 1958, 2, 428. [all data]
Khanna, 1959
Khanna, B.N.,
Emission spectrum of chlorine excited in the presence of argon,
Proc. Indian Acad. Sci. Sect. A, 1959, 49, 293-301. [all data]
Venkateswarlu and Khanna, 1959
Venkateswarlu, P.; Khanna, B.N.,
Emission spectrum of chlorine excited in the presence of argon. Part I. The band system in the region 2600-2390 Å,
Proc. Indian Acad. Sci. Sect. A, 1959, 49, 117-127. [all data]
Wieland, Tellinghuisen, et al., 1972
Wieland, K.; Tellinghuisen, J.B.; Nobs, A.,
The band systems E → B(4000-4360 Å) and F → X(2530-2740 Å) of 127I2 and 129I2, and the corresponding system E = B of Br2 and Cl2,
J. Mol. Spectrosc., 1972, 41, 69. [all data]
Cordes and Sponer, 1930
Cordes, H.; Sponer, H.,
Die molekulabsorption des chlors, broms, jodchlorids und jodbromids im aubersten ultraviolett,
Z. Phys., 1930, 63, 334. [all data]
Gibson and Bayliss, 1933
Gibson, G.E.; Bayliss, N.S.,
Variation with temperature of the continuous absorption spectrum of diatomic molecules: Part I. Experimental, the absorption spectrum of chlorine,
Phys. Rev., 1933, 44, 188. [all data]
Sulzer and Wieland, 1952
Sulzer, P.; Wieland, K.,
Intensitatsverteilung eines kontinuierlichen Absorptions-spectrums in Abhangigkeit von Temperatur und Wellenzahl,
Helv. Phys. Acta, 1952, 25, 653-676. [all data]
Jacobs and Giedt, 1965
Jacobs, T.A.; Giedt, R.R.,
Absorption coefficients of Cl2 at high temperatures,
J. Quant. Spectrosc. Radiat. Transfer, 1965, 5, 457. [all data]
Clyne and Stedman, 1968
Clyne, M.A.A.; Stedman, D.H.,
Recombination of ground-state halogen atoms. Part 1. Radiative recombination of chlorine atoms,
Trans. Faraday Soc., 1968, 64, 1816. [all data]
Palmer and Carabetta, 1968
Palmer, H.B.; Carabetta, R.A.,
Radiative recombination of chlorine atoms in shock waves: a re-examination,
J. Chem. Phys., 1968, 49, 2466. [all data]
Coxon, 1973
Coxon, J.A.,
Chapt. 4. Low-lying electronic states of diatomic halogen molecules
in Molecular Spectroscopy. Volume 1, Barrow,R.F.; Long,D.A.; Millen,D.J., ed(s)., The Chemical Society, Burlington House, London, W1V 0BN, 1973, 177-228. [all data]
Bondybey and Fletcher, 1976
Bondybey, V.E.; Fletcher, C.,
Photophysics of low lying electronic states of Cl2 in rare gas solids,
J. Chem. Phys., 1976, 64, 3615. [all data]
Winkel, Hunt, et al., 1969
Winkel, R.G.; Hunt, J.L.; Clouter, M.J.,
Pressure-induced fundamental infrared absorption band of gaseous chlorine,
J. Chem. Phys., 1969, 50, 1298. [all data]
Holzer, Murphy, et al., 1970
Holzer, W.; Murphy, W.F.; Bernstein, H.J.,
Resonance Raman effect and resonance fluoroscence in halogen gases,
J. Chem. Phys., 1970, 52, 399. [all data]
Hochenbleicher and Schrotter, 1971
Hochenbleicher, G.; Schrotter, H.W.,
Observation of hot bands in the Raman spectra of Cl2 gas and CCl4 vapor,
Appl. Spectrosc., 1971, 25, 3, 360-362. [all data]
Hendra and Vear, 1972
Hendra, P.J.; Vear, C.J.,
The pure rotational laser Raman spectrum of chlorine,
Spectrochim. Acta, Part A, 1972, 28, 1949-1961. [all data]
Wallart, 1972
Wallart, F.,
Study of vibrational hot bands by Raman spectroscopy - application to chlorine and bromine chloride,
Can. J. Spectrosc., 1972, 17, 128. [all data]
Edwards, Good, et al., 1976
Edwards, H.G.M.; Good, E.A.M.; Long, D.A.,
Pure rotational Raman spectra of the chlorine species, 35Cl2 and 35Cl37Cl,
J. Chem. Soc. Faraday Trans. 2, 1976, 72, 927-933. [all data]
Rao and Venkateswarlu, 1962
Rao, Y.V.; Venkateswarlu, P.,
Vacuum ultraviolet resonance spectrum of Cl2 molecule,
J. Mol. Spectrosc., 1962, 9, 173. [all data]
Douglas and Hoy, 1975
Douglas, A.E.; Hoy, A.R.,
The resonance fluorescence spectrum of Cl2 in the vacuum ultraviolet,
Can. J. Phys., 1975, 53, 1965-1975. [all data]
Busch, Mahoney, et al., 1969
Busch, G.E.; Mahoney, R.T.; Morse, R.I.,
Translational spectroscopy: Cl2 photodissociation,
J. Chem. Phys., 1969, 51, 449. [all data]
Child and Bernstein, 1973
Child, M.S.; Bernstein, R.B.,
Diatomic interhalogens: systematics and implications of spectroscopic interatomic potentials and curve crossings,
J. Chem. Phys., 1973, 59, 5916. [all data]
Brith, Rowe, et al., 1975
Brith, M.; Rowe, M.D.; Schnepp, O.; Stephens, P.J.,
The magnetic circular dichroism spectrum of the halogen molecules I2, Br2, Cl2. Resolution of overlapping continua,
Chem. Phys., 1975, 9, 57. [all data]
Douglas, Moller, et al., 1963
Douglas, A.E.; Moller, C.K.; Stoicheff, B.P.,
Can. J. Phys., 1963, 41, 1174. [all data]
Clyne and Coxon, 1970
Clyne, M.A.A.; Coxon, J.A.,
The visible band absorption spectrum of chlorine,
J. Mol. Spectrosc., 1970, 33, 381. [all data]
Clyne and Coxon, 1967
Clyne, M.A.A.; Coxon, J.A.,
The formation and detection of some low-lying excited electronic states of BrCl and other halogens,
Proc. R. Soc. London A, 1967, 298, 424. [all data]
Richards and Barrow, 1962
Richards, W.G.; Barrow, R.F.,
Rotational analysis of the A3Π0+,u - X1Σg+ system of the chlorine molecule,
Proc. Chem. Soc. London, 1962, 297. [all data]
Le Roy, 1973
Le Roy, R.J.,
Chapt. 3. Energy levels of a diatomic near dissociation
in Molecular Spectroscopy. Volume 1, Barrow,R.F.; Long,D.A.; Millen,D.J., ed(s)., The Chemical Society, Burlington House, London, W1V 0BN, 1973, 113-175. [all data]
LeRoy, 1974
LeRoy, R.J.,
Long-range potential coefficients from RKR turning points: C6 and C8 for B(3Π0u+)-state Cl2, Br2, and I2,
Can. J. Phys., 1974, 52, 246. [all data]
LeRoy and Bernstein, 1971
LeRoy, R.J.; Bernstein, R.B.,
Dissociation energies and long-range potentials of diatomic molecules from vibrational spacings: the halogens,
J. Mol. Spectrosc., 1971, 37, 109. [all data]
Goscinski, 1972
Goscinski, O.,
Outer vibrational turning points near dissociation in the B(3Π0u+) state of Br2 and Cl2,
Mol. Phys., 1972, 24, 655. [all data]
LeRoy, 1972
LeRoy, R.J.,
Dependence of the diatomic rotational constant Bv on the long-range internuclear potential,
Can. J. Phys., 1972, 50, 953. [all data]
Yee and Stone, 1973
Yee, K.K.; Stone, T.J.,
Analysis of RKR long-range potentials of the B3Π0u+ states of Br2 and Cl2,
Mol. Phys., 1973, 26, 1169. [all data]
Coxon, 1971
Coxon, J.A.,
Franck-Condon factors and r-centroids for halogen molecules. I. The B3Π(0u+)-X1Σg+ system of 35Cl2,
J. Quant. Spectrosc. Radiat. Transfer, 1971, 11, 1355. [all data]
Ault, Howard, et al., 1975
Ault, B.S.; Howard, W.F.; Andrews, L.,
Laser-induced fluorescence and Raman spectra of chlorine and bromine molecules isolated in inert matrices,
J. Mol. Spectrosc., 1975, 55, 217. [all data]
Radziemski and Kaufman, 1969
Radziemski, L.J., Jr.; Kaufman, V.,
Wavelengths, energy levels, and analysis of neutral atomic chlorine (Cl I),
J. Opt. Soc. Am., 1969, 59, 4, 424-443. [all data]
Cornford, Frost, et al., 1971
Cornford, A.B.; Frost, D.C.; McDowell, C.A.; Ragle, J.L.; Stenhouse, I.A.,
Photoelectron spectra of the halogens,
J. Chem. Phys., 1971, 54, 2651. [all data]
Potts and Price, 1971
Potts, A.W.; Price, W.C.,
Photoelectron spectra of the halogens and mixed halides ICI and lBr,
J. Chem. Soc. Faraday Trans., 1971, 67, 1242. [all data]
Watanabe, Nakayama, et al., 1962
Watanabe, K.; Nakayama, T.; Mottl, J.,
Ionization potentials of some molecules,
J. Quant. Spectry. Radiative Transfer, 1962, 2, 369. [all data]