Deuterium
- Formula: D2
- Molecular weight: 4.0282035556
- IUPAC Standard InChIKey: UFHFLCQGNIYNRP-VVKOMZTBSA-N
- CAS Registry Number: 7782-39-0
- Chemical structure:
View 3d structure (requires JavaScript / HTML 5) - Isotopologues:
- Other names: D2; UN 1957

Gas phase thermochemistry data

Quantity | Value | Units | Method | Reference | Comment |
---|---|---|---|---|---|
S°gas,1 bar | 144.96 | J/mol*K | Review | Chase, 1998 | Data last reviewed in March, 1982 |
Gas Phase Heat Capacity (Shomate Equation)
Cp° = A + B*t + C*t2 + D*t3 +
E/t2
H° − H°298.15= A*t + B*t2/2 +
C*t3/3 + D*t4/4 − E/t + F − H
S° = A*ln(t) + B*t + C*t2/2 + D*t3/3 −
E/(2*t2) + G
Cp = heat capacity (J/mol*K)
H° = standard enthalpy (kJ/mol)
S° = standard entropy (J/mol*K)
t = temperature (K) / 1000.
View plot Requires a JavaScript / HTML 5 canvas capable browser.
Temperature (K) | 298. to 1000. | 1000. to 2500. | 2500. to 6000. |
---|---|---|---|
A | 32.684534 | 20.123015 | 46.787245 |
B | -14.841301 | 15.023850 | -5.552026 |
C | 21.064857 | -4.776967 | 1.451072 |
D | -7.204633 | 0.593203 | -0.106099 |
E | -0.066534 | 0.670912 | -19.521487 |
F | -9.480583 | -4.449853 | -40.496576 |
G | 187.691048 | 168.515874 | 178.087513 |
H | 0.0 | 0.0 | 0.0 |
Reference | Chase, 1998 | Chase, 1998 | Chase, 1998 |
Comment | Data last reviewed in March, 1977; New parameter fit October 2001 | Data last reviewed in March, 1977; New parameter fit October 2001 | Data last reviewed in March, 1977; New parameter fit October 2001 |

Phase change data

Data compiled by: Thermodynamics Research Center, NIST Boulder Laboratories, Chris Muzny director
Quantity | Value | Units | Method | Reference | Comment |
---|---|---|---|---|---|
Ttriple | 18.73 | K | N/A | McConville and Pavese, 1988 | Uncertainty assigned by TRC = 0.0005 K; for normal D2 Temp. on IPTS-678, reproducible to 0.0002 K |
Ttriple | 18.69 | K | N/A | McConville and Pavese, 1988 | Uncertainty assigned by TRC = 0.0005 K; for equilibrium D2 Temp. on IPTS-678, reproducible to 0.0002 K |
Ttriple | 18.65 | K | N/A | Clusius and Weigand, 1940 | Uncertainty assigned by TRC = 0.2 K; see property X for dP/dT for c-l equil. |

Reaction thermochemistry data

Data compiled as indicated in comments:
B - John E. Bartmess
M - Michael M. Meot-Ner (Mautner) and Sharon G. Lias
Individual Reactions
Quantity | Value | Units | Method | Reference | Comment |
---|---|---|---|---|---|
ΔrH° | 1683.2 | kJ/mol | N/A | Shiell, Hu, et al., 2000 | gas phase; exact: 402.258±0.003 kcal/mol at 298K. Acid: D2; B |
ΔrH° | 1678.663 ± 0.042 | kJ/mol | D-EA | Lykke, Murray, et al., 1991 | gas phase; Reported: 6086.2±0.6 cm-1. Acid taken as HD -> H+ + D-; B |
ΔrH° | 1683.2 | kJ/mol | D-EA | Lykke, Murray, et al., 1991 | gas phase; Acid: D2 -> D- + D+. BDE: 105.98 Gurvich, Veyts, et al.. ΔSacid 22.9; B |
Quantity | Value | Units | Method | Reference | Comment |
ΔrG° | 1652.5 ± 0.46 | kJ/mol | H-TS | Lykke, Murray, et al., 1991 | gas phase; Reported: 6086.2±0.6 cm-1. Acid taken as HD -> H+ + D-; B |
ΔrG° | 1654.8 ± 0.42 | kJ/mol | H-TS | Lykke, Murray, et al., 1991 | gas phase; Acid: D2 -> D- + D+. BDE: 105.98 Gurvich, Veyts, et al.. ΔSacid 22.9; B |
By formula: (D3+ • 9D2) + D2 = (D3+ • 10D2)
Quantity | Value | Units | Method | Reference | Comment |
---|---|---|---|---|---|
ΔrH° | 3. | kJ/mol | PHPMS | Hiraoka and Mori, 1989 | gas phase; Entropy change calculated or estimated; M |
Quantity | Value | Units | Method | Reference | Comment |
ΔrS° | 84. | J/mol*K | N/A | Hiraoka and Mori, 1989 | gas phase; Entropy change calculated or estimated; M |
By formula: (D3+ • 2D2) + D2 = (D3+ • 3D2)
Quantity | Value | Units | Method | Reference | Comment |
---|---|---|---|---|---|
ΔrH° | 14.0 ± 0.8 | kJ/mol | PHPMS | Hiraoka and Mori, 1989 | gas phase; M |
Quantity | Value | Units | Method | Reference | Comment |
ΔrS° | 83.7 | J/mol*K | PHPMS | Hiraoka and Mori, 1989 | gas phase; M |
By formula: (D3+ • 3D2) + D2 = (D3+ • 4D2)
Quantity | Value | Units | Method | Reference | Comment |
---|---|---|---|---|---|
ΔrH° | 7.7 ± 0.4 | kJ/mol | PHPMS | Hiraoka and Mori, 1989 | gas phase; M |
Quantity | Value | Units | Method | Reference | Comment |
ΔrS° | 76.1 | J/mol*K | PHPMS | Hiraoka and Mori, 1989 | gas phase; M |
By formula: (D3+ • 4D2) + D2 = (D3+ • 5D2)
Quantity | Value | Units | Method | Reference | Comment |
---|---|---|---|---|---|
ΔrH° | 7.6 ± 0.4 | kJ/mol | PHPMS | Hiraoka and Mori, 1989 | gas phase; M |
Quantity | Value | Units | Method | Reference | Comment |
ΔrS° | 79.9 | J/mol*K | PHPMS | Hiraoka and Mori, 1989 | gas phase; M |
By formula: (D3+ • 5D2) + D2 = (D3+ • 6D2)
Quantity | Value | Units | Method | Reference | Comment |
---|---|---|---|---|---|
ΔrH° | 7.3 ± 0.4 | kJ/mol | PHPMS | Hiraoka and Mori, 1989 | gas phase; M |
Quantity | Value | Units | Method | Reference | Comment |
ΔrS° | 91.2 | J/mol*K | PHPMS | Hiraoka and Mori, 1989 | gas phase; M |
By formula: (D3+ • 6D2) + D2 = (D3+ • 7D2)
Quantity | Value | Units | Method | Reference | Comment |
---|---|---|---|---|---|
ΔrH° | 3.8 ± 0.4 | kJ/mol | PHPMS | Hiraoka and Mori, 1989 | gas phase; M |
Quantity | Value | Units | Method | Reference | Comment |
ΔrS° | 53.6 | J/mol*K | PHPMS | Hiraoka and Mori, 1989 | gas phase; M |
By formula: (D3+ • 7D2) + D2 = (D3+ • 8D2)
Quantity | Value | Units | Method | Reference | Comment |
---|---|---|---|---|---|
ΔrH° | 3.4 ± 0.4 | kJ/mol | PHPMS | Hiraoka and Mori, 1989 | gas phase; M |
Quantity | Value | Units | Method | Reference | Comment |
ΔrS° | 64.0 | J/mol*K | PHPMS | Hiraoka and Mori, 1989 | gas phase; M |
By formula: (D3+ • 8D2) + D2 = (D3+ • 9D2)
Quantity | Value | Units | Method | Reference | Comment |
---|---|---|---|---|---|
ΔrH° | 3.0 ± 0.4 | kJ/mol | PHPMS | Hiraoka and Mori, 1989 | gas phase; M |
Quantity | Value | Units | Method | Reference | Comment |
ΔrS° | 81.2 | J/mol*K | PHPMS | Hiraoka and Mori, 1989 | gas phase; M |
By formula: (D3+ • D2) + D2 = (D3+ • 2D2)
Quantity | Value | Units | Method | Reference | Comment |
---|---|---|---|---|---|
ΔrH° | 14.6 ± 0.8 | kJ/mol | PHPMS | Hiraoka and Mori, 1989 | gas phase; M |
Quantity | Value | Units | Method | Reference | Comment |
ΔrS° | 74.9 | J/mol*K | PHPMS | Hiraoka and Mori, 1989 | gas phase; M |
By formula: D3+ + D2 = (D3+ • D2)
Quantity | Value | Units | Method | Reference | Comment |
---|---|---|---|---|---|
ΔrH° | 30. ± 1. | kJ/mol | PHPMS | Hiraoka and Mori, 1989 | gas phase; M |
Quantity | Value | Units | Method | Reference | Comment |
ΔrS° | 78.7 | J/mol*K | PHPMS | Hiraoka and Mori, 1989 | gas phase; M |
By formula: Co+ + D2 = (Co+ • D2)
Enthalpy of reaction
ΔrH° (kJ/mol) | T (K) | Method | Reference | Comment |
---|---|---|---|---|
71.5 (+6.7,-0.) | CID | Haynes and Armentrout, 1996 | gas phase; guided ion beam CID; M |

Constants of diatomic molecules

Data compiled by: Klaus P. Huber and Gerhard H. Herzberg
Data collected through November, 1976
Symbol | Meaning |
---|---|
State | electronic state and / or symmetry symbol |
Te | minimum electronic energy (cm-1) |
ωe | vibrational constant – first term (cm-1) |
ωexe | vibrational constant – second term (cm-1) |
ωeye | vibrational constant – third term (cm-1) |
Be | rotational constant in equilibrium position (cm-1) |
αe | rotational constant – first term (cm-1) |
γe | rotation-vibration interaction constant (cm-1) |
De | centrifugal distortion constant (cm-1) |
βe | rotational constant – first term, centrifugal force (cm-1) |
re | internuclear distance (Å) |
Trans. | observed transition(s) corresponding to electronic state |
ν00 | position of 0-0 band (units noted in table) |
State | Te | ωe | ωexe | ωeye | Be | αe | γe | De | βe | re | Trans. | ν00 |
---|---|---|---|---|---|---|---|---|---|---|---|---|
u 3Πu 6pπ | 122365.6 | 1649.03 | 35.13 1 | 0.627 | 15.036 | 0.587 2 | 0.008 | 0.0053 | 1.0551 | u → a | 26286.75 | |
↳Cunningham and Dieke, 1950 | ||||||||||||
w (3Πg) 5dπ 3 | w → c | |||||||||||
↳Cunningham and Dieke, 1950 | ||||||||||||
q (3Σg+) 5dσ 3 | q → c | |||||||||||
↳Cunningham and Dieke, 1950 | ||||||||||||
n 3Πu 5pπ | 120976.9 | 1652.73 | 34.25 4 | 0.627 | 15.040 5 | 0.560 6 | 0.035 | 0.0053 | 1.0550 | n → a | 24900.14 | |
↳Cunningham and Dieke, 1950 | ||||||||||||
State | Te | ωe | ωexe | ωeye | Be | αe | γe | De | βe | re | Trans. | ν00 |
r 3Πg 4dπ | [(119380)] | 7 8 | r → c R | (22650) 7 | ||||||||
↳Cunningham and Dieke, 1950 | ||||||||||||
p 3Σg+ 4dδ | [119242] | p → c R | 22509.9 7 | |||||||||
↳Cunningham and Dieke, 1950 | ||||||||||||
k 3Πu 4pπ | 118396.7 | 1658.85 | 33.88 9 | 0.508 | 15.075 10 | 0.566 11 | 0.008 | 0.0046 | 1.0538 | k → a | 22323.06 | |
↳Cunningham and Dieke, 1950 | ||||||||||||
f 3Σu+ 4pσ | 116640 | 1618 | 32.8 | 14.66 | 0.62 | 1.069 | f → a R | 20546.0 | ||||
↳Cunningham and Dieke, 1950 | ||||||||||||
State | Te | ωe | ωexe | ωeye | Be | αe | γe | De | βe | re | Trans. | ν00 |
j 3Δg 3dδ | [114194.1] | 7 | j → c V | 17462.3 7 | ||||||||
↳Cunningham and Dieke, 1950 | ||||||||||||
i 3Πg 3dπ | (113093) | [1541.9] | 7 12 | i → e R | 5320.0 13 | |||||||
↳missing citation | ||||||||||||
i → c R | 17131.9 13 | |||||||||||
↳Cunningham and Dieke, 1950 | ||||||||||||
g 3Σg+ 3dσ | (112856) | [1511.3] | 7 | g → e R | 5067.8 | |||||||
↳missing citation | ||||||||||||
g → c R | 16879.8 | |||||||||||
↳Cunningham and Dieke, 1950 | ||||||||||||
State | Te | ωe | ωexe | ωeye | Be | αe | γe | De | βe | re | Trans. | ν00 |
d 3Πu 3pπ | 112729.8 14 | 1678.22 15 | 32.94 16 | 0.24 | 15.200 15 | 0.5520 | [0.0049] | 1.0494 | d → a R | 16666.0 | ||
↳Dieke, 1935 | ||||||||||||
e 3Σu+ 3pσ | 107774.0 | 1556.64 | 34.51 17 | 0.287 | 13.856 | 0.451 | [0.004] | 1.0991 | e → a R | 11649.1 | ||
↳Dieke, 1935, 2 | ||||||||||||
a 3Σg+ 2sσ | 95958.08 18 | 1885.84 | 35.96 18 | 0.34 | 17.109 | 0.606 | [0.0055] | 0.9891 | a → b 19 | |||
(a-X) | 95348.18 20 | |||||||||||
↳Dieke, 1935 | ||||||||||||
State | Te | ωe | ωexe | ωeye | Be | αe | γe | De | βe | re | Trans. | ν00 |
c 3Πu 2pπ | [96731.8] | [15.305] 21 | [0.00514] 21 | [1.0458] | c-X 22 | 95185.3 23 | ||||||
↳Cunningham and Dieke, 1950 | ||||||||||||
b 3Σu+ 2pσ | Lower state of continuous spectrum of D2 (a → b). | |||||||||||
Rydberg | Ionization continua joining on to Rydberg series. 24 | |||||||||||
v'=0 Rydberg series of rotational levels observed in low temperature absorption from X 1Σg+ (v=0) and converging to: | ||||||||||||
Rydberg 25 | R(0) lines (ortho-D2) | |||||||||||
↳Takezawa and Tanaka, 1975 | ||||||||||||
State | Te | ωe | ωexe | ωeye | Be | αe | γe | De | βe | re | Trans. | ν00 |
Rydberg 26 | Q(1) lines (para-D2) | |||||||||||
↳Takezawa and Tanaka, 1975 | ||||||||||||
Rydberg 27 | R(0) lines (ortho-D2) | |||||||||||
↳Takezawa and Tanaka, 1975 | ||||||||||||
B bar 1Σu+ | see 1H2 | |||||||||||
↳Dabrowski and Herzberg, 1974; Chupka, Dehmer, et al., 1975; Kolos, 1976 | ||||||||||||
D" 1Πu 5pπ | 121227.5 28 | 1648.68 28 | 33.638 28 29 | 0.3034 | 15.133 30 31 | 0.6521 30 | 0.01329 | [0.00704] 30 | 0.01329 | 1.0517 | D" ← X R | 120497.0 28 |
↳Monfils, 1965; Monfils, 1968; Takezawa and Tanaka, 1975 | ||||||||||||
State | Te | ωe | ωexe | ωeye | Be | αe | γe | De | βe | re | Trans. | ν00 |
D' 1Πu 4pπ | 118887.9 28 | 1653.15 28 | 33.35 28 32 | 0.226 | 15.041 33 31 | 0.5508 33 | 0.00503 | [0.00323] 33 | 1.0550 | D' ← X R | 118159.7 28 | |
↳Monfils, 1965; Monfils, 1968; Takezawa and Tanaka, 1975 | ||||||||||||
B" 1Σu+ 4pσ | 117970.7 | 1563.02 | 35.416 34 | 0.0843 | 13.685 31 | 0.3842 35 | 0.00024 | 1.1060 | B" ← X R | 117196.9 | ||
↳Monfils, 1965; Monfils, 1968; Takezawa and Tanaka, 1975 | ||||||||||||
M 1Σg+ | [114504.5] 36 | [4.0] | [2.06] | M → B R | 22324.2 | |||||||
↳Dieke and Lewis, 1937 | ||||||||||||
D 1Πu 3pπ | 113914.0 | 1667.60 | 33.343 37 | 15.11 38 31 | 0.54 39 | 0.005 39 | -0.002 | 1.053 | D ← X R | 113193.0 40 | ||
↳Monfils, 1965; Monfils, 1968 | ||||||||||||
State | Te | ωe | ωexe | ωeye | Be | αe | γe | De | βe | re | Trans. | ν00 |
I 1Πg 3dπ | 113081.5 | 1600.14 | 39.42 | 14.739 41 42 | 0.526 41 | [0.0025] 41 | 1.0657 | I → B V | 21691.4 43 | |||
↳Dieke and Lewis, 1937 | ||||||||||||
G 1Σg+ 3dσ | (112893) | [1440.8] | 44 45 | G → B R | 21433.2 | |||||||
↳Dieke and Lewis, 1937 | ||||||||||||
K (1Σg+) | (112610) | [1660] | [6.6] | [1.59] | K → B | (21260) 46 | ||||||
↳Dieke and Lewis, 1937 | ||||||||||||
B' 1Σu+ 3pσ | 111642.2 47 | 1451.98 | 45.679 48 | 2.096 | 13.605 31 | 0.920 49 | [0.00415] 50 | 1.1092 | B' ← X R | 110815.65 | ||
↳Monfils, 1965; Monfils, 1968; missing citation | ||||||||||||
State | Te | ωe | ωexe | ωeye | Be | αe | γe | De | βe | re | Trans. | ν00 |
F 1Σg+ 2pσ2 | (100931.2) 51 | [859.1] 52 | 53 | 53 | F → B R | |||||||
↳Dieke and Cunningham, 1965 | ||||||||||||
E 1Σg+ 2sσ | 100128.1 | 1784.42 | 48.105 | 16.3696 | 0.6764 | [0.0054] | 1.01124 | E → N V | 8827.99 | |||
↳Dieke and Cunningham, 1965 | ||||||||||||
C 1Πu 2pπ | 100097.2 54 | 1729.92 | 34.917 55 | 0.2612 | 15.6731 56 | 0.5679 57 | 0.00532 58 | 1.03346 | CX ↔ 59 R | 99409.18 60 | ||
↳missing citation; missing citation | ||||||||||||
B 1Σu+ 2pσ | 91697.2 54 | 963.08 | 11.038 61 | 10.0680 56 | 0.4198 62 | 0.00403 63 | 1.28944 | B ↔ X 64 65 R | 90633.79 | |||
↳missing citation; missing citation; missing citation | ||||||||||||
State | Te | ωe | ωexe | ωeye | Be | αe | γe | De | βe | re | Trans. | ν00 |
X 1Σg+ 1sσ2 | 0 | 3115.50 | 61.82 66 | 0.562 | 30.4436 67 | 1.0786 68 | 0.01141 69 | 0.74152 | ||||
↳Brannon, Church, et al., 1968 | ||||||||||||
Field- and pressure-induced sp. 70 | ||||||||||||
↳Watanabe and Welsh, 1965; Reddy and Kuo, 1971; Russell, Reddy, et al., 1974 | ||||||||||||
Raman sp. | ||||||||||||
↳Stoicheff, 1957 | ||||||||||||
Rf magn. Reson. sp. 71 | ||||||||||||
↳Kolsky, Phipps, et al., 1952; Ramsey, 1956; English and MacAdam, 1970; Code and Ramsey, 1971 |

Gas phase ion energetics data

Data compiled as indicated in comments:
LL - Sharon G. Lias and Joel F. Liebman
LLK - Sharon G. Lias, Rhoda D. Levin, and Sherif A. Kafafi
RDSH - Henry M. Rosenstock, Keith Draxl, Bruce W. Steiner, and John T. Herron
Ionization energy determinations
IE (eV) | Method | Reference | Comment |
---|---|---|---|
15.46658 | EVAL | Shiner, Gilligan, et al., 1993 | LL |
15.4666 ± 0.0001 | EVAL | Huber and Herzberg, 1979 | LLK |
15.4667 ± 0.0001 | S | Takezawa and Tanaka, 1975 | LLK |
15.43 ± 0.01 | EI | Lossing and Semeluk, 1969 | RDSH |
15.468 ± 0.022 | TE | Villarejo, 1968 | RDSH |
15.47 | PE | Spohr and Puttkamer, 1967 | RDSH |
15.46 ± 0.01 | PI | Dibeler, Reese, et al., 1965 | RDSH |
15.5 | EI | Briglia and Rapp, 1965 | RDSH |
Appearance energy determinations
Ion | AE (eV) | Other Products | Method | Reference | Comment |
---|---|---|---|---|---|
D+ | 25.3 ± 0.2 | D | EI | Olmsted, Street, et al., 1964 | RDSH |

Ion clustering data

Data compiled by: Michael M. Meot-Ner (Mautner) and Sharon G. Lias
Clustering reactions
By formula: Co+ + D2 = (Co+ • D2)
Enthalpy of reaction
ΔrH° (kcal/mol) | T (K) | Method | Reference | Comment |
---|---|---|---|---|
17.1 (+1.6,-0.) | CID | Haynes and Armentrout, 1996 | gas phase; guided ion beam CID |
By formula: D3+ + D2 = (D3+ • D2)
Quantity | Value | Units | Method | Reference | Comment |
---|---|---|---|---|---|
ΔrH° | 7.1 ± 0.3 | kcal/mol | PHPMS | Hiraoka and Mori, 1989 | gas phase |
Quantity | Value | Units | Method | Reference | Comment |
ΔrS° | 18.8 | cal/mol*K | PHPMS | Hiraoka and Mori, 1989 | gas phase |
By formula: (D3+ • D2) + D2 = (D3+ • 2D2)
Quantity | Value | Units | Method | Reference | Comment |
---|---|---|---|---|---|
ΔrH° | 3.5 ± 0.2 | kcal/mol | PHPMS | Hiraoka and Mori, 1989 | gas phase |
Quantity | Value | Units | Method | Reference | Comment |
ΔrS° | 17.9 | cal/mol*K | PHPMS | Hiraoka and Mori, 1989 | gas phase |
By formula: (D3+ • 2D2) + D2 = (D3+ • 3D2)
Quantity | Value | Units | Method | Reference | Comment |
---|---|---|---|---|---|
ΔrH° | 3.4 ± 0.2 | kcal/mol | PHPMS | Hiraoka and Mori, 1989 | gas phase |
Quantity | Value | Units | Method | Reference | Comment |
ΔrS° | 20.0 | cal/mol*K | PHPMS | Hiraoka and Mori, 1989 | gas phase |
By formula: (D3+ • 3D2) + D2 = (D3+ • 4D2)
Quantity | Value | Units | Method | Reference | Comment |
---|---|---|---|---|---|
ΔrH° | 1.8 ± 0.1 | kcal/mol | PHPMS | Hiraoka and Mori, 1989 | gas phase |
Quantity | Value | Units | Method | Reference | Comment |
ΔrS° | 18.2 | cal/mol*K | PHPMS | Hiraoka and Mori, 1989 | gas phase |
By formula: (D3+ • 4D2) + D2 = (D3+ • 5D2)
Quantity | Value | Units | Method | Reference | Comment |
---|---|---|---|---|---|
ΔrH° | 1.8 ± 0.1 | kcal/mol | PHPMS | Hiraoka and Mori, 1989 | gas phase |
Quantity | Value | Units | Method | Reference | Comment |
ΔrS° | 19.1 | cal/mol*K | PHPMS | Hiraoka and Mori, 1989 | gas phase |
By formula: (D3+ • 5D2) + D2 = (D3+ • 6D2)
Quantity | Value | Units | Method | Reference | Comment |
---|---|---|---|---|---|
ΔrH° | 1.7 ± 0.1 | kcal/mol | PHPMS | Hiraoka and Mori, 1989 | gas phase |
Quantity | Value | Units | Method | Reference | Comment |
ΔrS° | 21.8 | cal/mol*K | PHPMS | Hiraoka and Mori, 1989 | gas phase |
By formula: (D3+ • 6D2) + D2 = (D3+ • 7D2)
Quantity | Value | Units | Method | Reference | Comment |
---|---|---|---|---|---|
ΔrH° | 0.9 ± 0.1 | kcal/mol | PHPMS | Hiraoka and Mori, 1989 | gas phase |
Quantity | Value | Units | Method | Reference | Comment |
ΔrS° | 12.8 | cal/mol*K | PHPMS | Hiraoka and Mori, 1989 | gas phase |
By formula: (D3+ • 7D2) + D2 = (D3+ • 8D2)
Quantity | Value | Units | Method | Reference | Comment |
---|---|---|---|---|---|
ΔrH° | 0.8 ± 0.1 | kcal/mol | PHPMS | Hiraoka and Mori, 1989 | gas phase |
Quantity | Value | Units | Method | Reference | Comment |
ΔrS° | 15.3 | cal/mol*K | PHPMS | Hiraoka and Mori, 1989 | gas phase |
By formula: (D3+ • 8D2) + D2 = (D3+ • 9D2)
Quantity | Value | Units | Method | Reference | Comment |
---|---|---|---|---|---|
ΔrH° | 0.7 ± 0.1 | kcal/mol | PHPMS | Hiraoka and Mori, 1989 | gas phase |
Quantity | Value | Units | Method | Reference | Comment |
ΔrS° | 19.4 | cal/mol*K | PHPMS | Hiraoka and Mori, 1989 | gas phase |
By formula: (D3+ • 9D2) + D2 = (D3+ • 10D2)
Quantity | Value | Units | Method | Reference | Comment |
---|---|---|---|---|---|
ΔrH° | 0.6 | kcal/mol | PHPMS | Hiraoka and Mori, 1989 | gas phase; Entropy change calculated or estimated |
Quantity | Value | Units | Method | Reference | Comment |
ΔrS° | 20. | cal/mol*K | N/A | Hiraoka and Mori, 1989 | gas phase; Entropy change calculated or estimated |

References

Chase, 1998
Chase, M.W., Jr.,
NIST-JANAF Themochemical Tables, Fourth Edition,
J. Phys. Chem. Ref. Data, Monograph 9, 1998, 1-1951. [all data]
McConville and Pavese, 1988
McConville, G.T.; Pavese, F.,
Physicochemical problems involved in measuring thermodynamic properties of normal and equilibrium deuterium at the triple point,
J. Chem. Thermodyn., 1988, 20, 337. [all data]
Clusius and Weigand, 1940
Clusius, K.; Weigand, K.,
Melting Curves of the Gases A, Kr, Xe, CH4, CH3D, CD4, C2H4, C2H6, COS, and PH3 to 200 Atmospheres Pressure. The Chane of Volume on Melting,
Z. Phys. Chem., Abt. B, 1940, 46, 1-37. [all data]
Shiell, Hu, et al., 2000
Shiell, R.C.; Hu, X.K.; Hu, Q.C.J.; Hepburn, J.W.,
Threshold Ion-pair Production spectroscopy (TIPPS) of H2 and D2,
Faraday Disc. Chem. Soc., 2000, 115, 331, https://doi.org/10.1039/a909428h
. [all data]
Lykke, Murray, et al., 1991
Lykke, K.R.; Murray, K.K.; Lineberger, W.C.,
Threshold Photodetachment of H-,
Phys. Rev. A, 1991, 43, 11, 6104, https://doi.org/10.1103/PhysRevA.43.6104
. [all data]
Gurvich, Veyts, et al.
Gurvich, L.V.; Veyts, I.V.; Alcock, C.B.,
Hemisphere Publishing, NY, 1989, V. 1 2, Thermodynamic Properties of Individual Substances, 4th Ed. [all data]
Hiraoka and Mori, 1989
Hiraoka, K.; Mori, T.,
Thermochemical Stabilities of D3+(D2)n with n = 1 - 10,
Chem. Phys. Lett., 1989, 157, 5, 467, https://doi.org/10.1016/0009-2614(89)87282-3
. [all data]
Haynes and Armentrout, 1996
Haynes, C.L.; Armentrout, P.B.,
Guided Ion Beam Determination of the Co+ - H2 Bond Dissociation energy,
Chem Phys. Let., 1996, 249, 1-2, 64, https://doi.org/10.1016/0009-2614(95)01337-7
. [all data]
Cunningham and Dieke, 1950
Cunningham; Dieke,
Johns Hopkins University, Department of Physics, Rpt. NYO-692, 1950, 1. [all data]
Dieke, 1935
Dieke, G.H.,
The triplet 3p complex of the hydrogen molecule,
Phys. Rev., 1935, 48, 610. [all data]
Dieke, 1935, 2
Dieke, G.H.,
The 3p3Σ→2s3Σ bands of HD and D2,
Phys. Rev., 1935, 48, 606. [all data]
Takezawa and Tanaka, 1975
Takezawa, S.; Tanaka, Y.,
The absorption spectrum of D2 in the vacuum-uv region, Rydberg bands, noσ1Σu+←X1Σg+ and npπ1π←X1Σg+ with n=4-6, and the ionization energy,
J. Mol. Spectrosc., 1975, 54, 379. [all data]
Dabrowski and Herzberg, 1974
Dabrowski, I.; Herzberg, G.,
The absorption spectrum of D2 from 1100 to 840 Å,
Can. J. Phys., 1974, 52, 1110. [all data]
Chupka, Dehmer, et al., 1975
Chupka, W.A.; Dehmer, P.M.; Jivery, W.T.,
High resolution photoionization study of ion-pair formation in H2, HD, and D2,
J. Chem. Phys., 1975, 63, 3929. [all data]
Kolos, 1976
Kolos, W.,
Ab initio potential energy curves and vibrational levels for the B", B«macron», and B'1Σu+ states of the hydrogen molecule,
J. Mol. Spectrosc., 1976, 62, 429. [all data]
Monfils, 1965
Monfils, A.,
The absorption spectra of the molecules H2, HD, and D2. Part VI. Rotational analysis of the B', B", D, D', and D" states,
J. Mol. Spectrosc., 1965, 15, 265. [all data]
Monfils, 1968
Monfils, A.,
Absorption spectra of molecules H2, HD, and D2. VII. Vibrational constants of the B, B', B", C, D, D', and D" states,
J. Mol. Spectrosc., 1968, 25, 513. [all data]
Dieke and Lewis, 1937
Dieke, G.H.; Lewis, M.N.,
Bands of HD and D2 ending on the 2p1Σ state,
Phys. Rev., 1937, 52, 100. [all data]
Dieke and Cunningham, 1965
Dieke, G.H.; Cunningham, S.P.,
Bands of D2 and T2 originating from the lowest excited 1Σg states (1sσ)(2sσ)1Σg and (2pσ)21Σg,
J. Mol. Spectrosc., 1965, 18, 288. [all data]
Brannon, Church, et al., 1968
Brannon, P.J.; Church, C.H.; Peters, C.W.,
Electric field induced spectra of molecular hydrogen, deuterium and deuterium hydride,
J. Mol. Spectrosc., 1968, 27, 44. [all data]
Watanabe and Welsh, 1965
Watanabe, A.; Welsh, H.L.,
Pressure-induced infrared absorption of gaseous hydrogen and deuterium at low temperatures,
Can. J. Phys., 1965, 43, 818. [all data]
Reddy and Kuo, 1971
Reddy, S.P.; Kuo, C.Z.,
Collision-induced 1st overtone infrared absorption band of deuterium,
J. Mol. Spectrosc., 1971, 37, 327. [all data]
Russell, Reddy, et al., 1974
Russell, W.E.; Reddy, S.P.; Cho, C.W.,
Collision-induced fundamental band of D2 in D2-He and D2-Ne mixtures at different temperatures,
J. Mol. Spectrosc., 1974, 52, 72. [all data]
Stoicheff, 1957
Stoicheff, B.P.,
High resolution Raman spectroscopy of gases. IX. Spectra of H2, HD, and D2,
Can. J. Phys., 1957, 35, 730. [all data]
Kolsky, Phipps, et al., 1952
Kolsky, H.G.; Phipps, T.E., Jr.; Ramsey, N.F.; Silsbee, H.B.,
Nuclear radiofrequency spectra of H2 and D2 in high and low magnetic fields,
Phys. Rev., 1952, 87, 395. [all data]
Ramsey, 1956
Ramsey,
Molecular Beams, Clarendon Press, Oxford, 1956, 238. [all data]
English and MacAdam, 1970
English, T.C.; MacAdam, K.B.,
Molecular-beam resonance measurement of deuterium polarizability anisotropy,
Phys. Rev. Lett., 1970, 24, 555-557. [all data]
Code and Ramsey, 1971
Code, R.F.; Ramsey, N.F.,
Molecular-beam magnetic resonance studies of HD and D2,
Phys. Rev. A: Gen. Phys., 1971, 4, 1945. [all data]
Miller, Freund, et al., 1976
Miller, T.A.; Freund, R.S.; Zegarski, B.R.,
A forbidden singlet-triplet anticrossing in D2,
J. Chem. Phys., 1976, 64, 1842. [all data]
Jost, Lombardi, et al., 1976
Jost, R.; Lombardi, M.; Derouard, J.; Freund, R.S.; Miller, T.A.; Zegarski, B.R.,
Singlet-triplet anticrossings and the electronic isotope shift in D2,
Chem. Phys. Lett., 1976, 37, 507. [all data]
Freund and Miller, 1973
Freund, R.S.; Miller, T.A.,
Fine structure of ortho- and para-D2 d(3p) 3Πu via microwave optical magnetic resonance induced by electrons,
J. Chem. Phys., 1973, 59, 4073. [all data]
Freund and Miller, 1973, 2
Freund, R.S.; Miller, T.A.,
Fine structure of para-H2 d(3p) 3Πu (ν=0-3) via microwave optical magnetic resonance induced by electrons,
J. Chem. Phys., 1973, 58, 3565. [all data]
Smith and Chevalier, 1972
Smith, W.H.; Chevalier, R.,
Radiative-lifetime studies of the emission continua of the hydrogen and deuterium molecules,
Astrophys. J., 1972, 177, 835. [all data]
Johnson, 1972
Johnson, C.E.,
Lifetime of the c3Πu metastable state of H2, D2, and HD,
Phys. Rev. A: Gen. Phys., 1972, 5, 1026. [all data]
Villarejo, 1968
Villarejo, D.,
Measurement of threshold electrons in the photoionization of H2 and D2,
J. Chem. Phys., 1968, 48, 4014. [all data]
Berkowitz and Spohr, 1973
Berkowitz, J.; Spohr, R.,
Comparison of photoelectron intensities and Franck-Condon factors in the photoionization of H2, HD and D2,
J. Electron Spectrosc. Relat. Phenom., 1973, 2, 143. [all data]
Dunn, 1966
Dunn, G.H.,
Franck-Condon factors for the ionization of H2 and D2,
J. Chem. Phys., 1966, 44, 2592. [all data]
Villarejo, 1968, 2
Villarejo, D.,
Vibration-rotation interaction effects in calculated Franck-Condon factors. I. The ionization of H2 and D2,
J. Chem. Phys., 1968, 49, 2523. [all data]
Itikawa, 1973
Itikawa, Y.,
Calculation of the cross sections for the photoionization of H2 and D2 into different vibrational states of the ion,
J. Electron Spectrosc. Relat. Phenom., 1973, 2, 125. [all data]
Ford, Docken, et al., 1975
Ford, A.L.; Docken, K.K.; Dalgarno, A.,
Cross sections for photoionization of vibrationally excited molecular hydrogen,
Astrophys. J., 1975, 200, 788. [all data]
Monfils, 1968, 2
Monfils, A.,
Calcul des fonctions potentielles de divers etats signulets excites des molecules H2, HD et D2,
Bull. Cl. Sci. Acad. R. Belg., 1968, 54, 44. [all data]
Comes and Schumpe, 1971
Comes, F.J.; Schumpe, G.,
Einfluss der Rotation auf die Lebensdauer pradissoziierender Molekule,
Z. Naturforsch. A, 1971, 26, 538. [all data]
Comes and Wenning, 1970
Comes, F.J.; Wenning, U.,
Pradissoziation im elektrischen Feld - ein neues Phanomen in der Molekulspektroskopie,
Z. Naturforsch. A, 1970, 25, 406. [all data]
Fiquet-Fayard and Gallais, 1972
Fiquet-Fayard, F.; Gallais, O.,
Predissociation of H2 and D2 (D1Πu): comparison of calculated and experimental line-widths,
Chem. Phys. Lett., 1972, 16, 18. [all data]
Dieke, 1954
Dieke, G.H.,
Nouveaux resultats pour le spectre des molecules de l'hydrogene et de ses isotopes,
J. Phys. Radium, 1954, 15, 393. [all data]
Kolos and Wolniewicz, 1969
Kolos, W.; Wolniewicz, L.,
Theoretical investigation of the lowest double-minimum state E, F1Σg+ of the hydrogen molecule,
J. Chem. Phys., 1969, 50, 3228. [all data]
Kolos and Wolniewicz, 1965
Kolos, W.; Wolniewicz, L.,
Potential-energy curves for the X1Σg+, b3Σu+, and C1Πu states of the hydrogen molecule,
J. Chem. Phys., 1965, 43, 2429. [all data]
Geiger and Schmoranzer, 1969
Geiger, J.; Schmoranzer, H.,
Electronic and vibrational transition probabilities of isotopic hydrogen molecules H2, HD, and D2 based on electron energy loss spectra,
J. Mol. Spectrosc., 1969, 32, 39. [all data]
Allison and Dalgarno, 1969
Allison, A.C.; Dalgarno, A.,
Photodissociation of vibrationally excited H2, HD, and D2 by absorption into the continua of the Lyman and Werner systems,
At. Data, 1969, 1, 91. [all data]
Takezawa, Innes, et al., 1967
Takezawa, S.; Innes, F.R.; Tanaka, Y.,
Selective enhancement in hydrogenlike molecules with the rare gases. II. HD and D2 with Ar and Kr,
J. Chem. Phys., 1967, 46, 4555. [all data]
Halmann and Laulicht, 1966
Halmann, M.; Laulicht, I.,
Isotope effects on Franck-Condon factors. V. Electronic transitions of isotopic O2, N2, C2, and H2 molecules,
J. Chem. Phys., 1966, 44, 2398. [all data]
Dalgarno, Herzberg, et al., 1970
Dalgarno, A.; Herzberg, G.; Stephens, T.L.,
A new continuous emission spectrum of the hydrogen molecule,
Astrophys. J., 1970, 162, 49. [all data]
Bredohl and Herzberg, 1973
Bredohl, H.; Herzberg, G.,
The Lyman and Werner bands of deuterium,
Can. J. Phys., 1973, 51, 867. [all data]
LeRoy, 1971
LeRoy, R.J.,
Eigenvalues and certain expectation values for all bound and quasibound levels of ground-state (X1Σg+)H2, HD, and D2,
J. Chem. Phys., 1971, 54, 5433. [all data]
Kolos and Wolniewicz, 1975
Kolos, W.; Wolniewicz, L.,
Improved potential energy curve and vibrational energies for the electronic ground state of the hydrogen molecule,
J. Mol. Spectrosc., 1975, 54, 303. [all data]
Bunker, 1972
Bunker, P.R.,
On the breakdown of the Born-Oppenheimer approximation for a diatomic molecule,
J. Mol. Spectrosc., 1972, 5, 478. [all data]
Dabrowski and Herzberg, 1976
Dabrowski, I.; Herzberg, G.,
The absorption and emission spectra of HD in the vacuum ultraviolet,
Can. J. Phys., 1976, 54, 525. [all data]
Ramsey, 1952
Ramsey, N.F.,
Theory of molecular hydrogen and deuterium in magnetic fields,
Phys. Rev., 1952, 85, 60. [all data]
Herzberg, 1970
Herzberg, G.,
The dissociation energy of the hydrogen molecule,
J.Mol. Spectry., 1970, 33, 147. [all data]
LeRoy and Barwell, 1975
LeRoy, R.J.; Barwell, M.G.,
Ground state D2 dissociation energy from the near-dissociation behavior of rotational level spacings,
Can. J. Phys., 1975, 53, 1983. [all data]
Herzberg, 1972
Herzberg, G.,
Spectroscopic studies of molecular structure,
Science, 1972, 177, 123. [all data]