1-Penten-3-one, 1-(2,6,6-trimethyl-2-cyclohexen-1-yl)-
- Formula: C14H22O
- Molecular weight: 206.3239
- IUPAC Standard InChIKey: VPKMGDRERYMTJX-CMDGGOBGSA-N
- CAS Registry Number: 7779-30-8
- Chemical structure:
View 3d structure (requires JavaScript / HTML 5) - Stereoisomers:
- Other names: 1-(2,6,6-Trimethylcyclohex-2-en-1-yl)pent-1-en-3-one; α-N-Methyl ionone; 1-(2,6,6-Trimethylcyclohex-2-en-1-yl)-1-pentene-3-one; 1-(2,6,6-trimethyl-2-cyclohexen-1-yl)pent-1-en-3-one

Kovats' RI, non-polar column, isothermal

Column type | Active phase | Temperature (C) | I | Reference | Comment |
---|---|---|---|---|---|
Capillary | SE-30 | 100. | 1503.2 | Tudor, 1997 | 40. m/0.35 mm/0.35 μm |

Kovats' RI, polar column, isothermal

Column type | Active phase | Temperature (C) | I | Reference | Comment |
---|---|---|---|---|---|
Capillary | Carbowax 20M | 150. | 1933. | Tudor, Moldovan, et al., 1999 | Phase thickness: 0.45 μm |

References

Tudor, 1997
Tudor, E.,
Temperature dependence of the retention index for perfumery compounds on a SE-30 glass capillary column. I. Linear equations,
J. Chromatogr. A, 1997, 779, 1-2, 287-297, https://doi.org/10.1016/S0021-9673(97)00453-6
. [all data]
Tudor, Moldovan, et al., 1999
Tudor, E.; Moldovan, D.; Zârna, N.,
Temperature dependence of the retention index for perfumery compounds on two carbowax-20M glass capillary columns with different film thickness. 2,
Rev. Roum. Chim., 1999, 44, 7, 665-675. [all data]