potassium sulfate
- Formula: K2O4S
- Molecular weight: 174.259
- CAS Registry Number: 7778-80-5

Gas phase thermochemistry data

Quantity | Value | Units | Method | Reference | Comment |
---|---|---|---|---|---|
ΔfH°gas | -1094.12 | kJ/mol | Review | Chase, 1998 | Data last reviewed in June, 1978 |
Quantity | Value | Units | Method | Reference | Comment |
S°gas,1 bar | 366.14 | J/mol*K | Review | Chase, 1998 | Data last reviewed in June, 1978 |
Gas Phase Heat Capacity (Shomate Equation)
Cp° = A + B*t + C*t2 + D*t3 +
E/t2
H° − H°298.15= A*t + B*t2/2 +
C*t3/3 + D*t4/4 − E/t + F − H
S° = A*ln(t) + B*t + C*t2/2 + D*t3/3 −
E/(2*t2) + G
Cp = heat capacity (J/mol*K)
H° = standard enthalpy (kJ/mol)
S° = standard entropy (J/mol*K)
t = temperature (K) / 1000.
View plot Requires a JavaScript / HTML 5 canvas capable browser.
Temperature (K) | 3000. to 6000. |
---|---|
A | 156.9912 |
B | 0.548543 |
C | -0.110834 |
D | 0.007664 |
E | -7.906756 |
F | -1163.244 |
G | 522.4101 |
H | -1094.116 |
Reference | Chase, 1998 |
Comment | Data last reviewed in June, 1978 |

Condensed phase thermochemistry data

Quantity | Value | Units | Method | Reference | Comment |
---|---|---|---|---|---|
ΔfH°liquid | -1393.67 | kJ/mol | Review | Chase, 1998 | Data last reviewed in June, 1978 |
Quantity | Value | Units | Method | Reference | Comment |
S°liquid,1 bar | 211.42 | J/mol*K | Review | Chase, 1998 | Data last reviewed in June, 1978 |
Quantity | Value | Units | Method | Reference | Comment |
ΔfH°solid | -1437.71 | kJ/mol | Review | Chase, 1998 | α phase; Data last reviewed in June, 1978 |
Liquid Phase Heat Capacity (Shomate Equation)
Cp° = A + B*t + C*t2 + D*t3 +
E/t2
H° − H°298.15= A*t + B*t2/2 +
C*t3/3 + D*t4/4 − E/t + F − H
S° = A*ln(t) + B*t + C*t2/2 + D*t3/3 −
E/(2*t2) + G
Cp = heat capacity (J/mol*K)
H° = standard enthalpy (kJ/mol)
S° = standard entropy (J/mol*K)
t = temperature (K) / 1000.
View plot Requires a JavaScript / HTML 5 canvas capable browser.
Temperature (K) | 1342. to 3000. |
---|---|
A | 201.4604 |
B | 0.000000 |
C | 0.000000 |
D | 0.000000 |
E | 0.000000 |
F | -1471.274 |
G | 415.5017 |
H | -1393.669 |
Reference | Chase, 1998 |
Comment | Data last reviewed in June, 1978 |
Solid Phase Heat Capacity (Shomate Equation)
Cp° = A + B*t + C*t2 + D*t3 +
E/t2
H° − H°298.15= A*t + B*t2/2 +
C*t3/3 + D*t4/4 − E/t + F − H
S° = A*ln(t) + B*t + C*t2/2 + D*t3/3 −
E/(2*t2) + G
Cp = heat capacity (J/mol*K)
H° = standard enthalpy (kJ/mol)
S° = standard entropy (J/mol*K)
t = temperature (K) / 1000.
View plot Requires a JavaScript / HTML 5 canvas capable browser.
Temperature (K) | 298. to 1200. | 298. to 1342. |
---|---|---|
A | 139.5050 | 114.3424 |
B | -1.199884 | 81.29554 |
C | 136.8080 | -0.000942 |
D | -47.14322 | -0.016197 |
E | -1.663999 | 0.000141 |
F | -1485.964 | -1461.948 |
G | 329.6528 | 306.4152 |
H | -1437.706 | -1424.246 |
Reference | Chase, 1998 | Chase, 1998 |
Comment | α phase; Data last reviewed in June, 1978 | β phase; Data last reviewed in June, 1978 |

Reaction thermochemistry data

Data compiled as indicated in comments:
MS - José A. Martinho Simões
M - Michael M. Meot-Ner (Mautner) and Sharon G. Lias
Individual Reactions
C2H5KO (cr) + 0.5( • 1100
) (solution) =
(solution) + 0.5K2O4S (solution)
By formula: C2H5KO (cr) + 0.5(H2O4S • 1100H2O) (solution) = C2H6O (solution) + 0.5K2O4S (solution)
Quantity | Value | Units | Method | Reference | Comment |
---|---|---|---|---|---|
ΔrH° | -132.3 ± 2.9 | kJ/mol | RSC | Blanchard, Joly, et al., 1974 | solvent: Sulphuric acid aqueous solution; The reaction enthalpy relies on -10.6 kJ/mol for the enthalpy of solution of EtOH(l) and on 35.1±0.1 for the enthalpy of solution of K2SO4(cr) Blanchard, Joly, et al., 1974.; MS |
By formula: K+ + K2O4S = (K+ • K2O4S)
Quantity | Value | Units | Method | Reference | Comment |
---|---|---|---|---|---|
ΔrH° | 160. | kJ/mol | MS | Kudin, Gusarov, et al., 1973 | gas phase; Knudsen cell; M |

Ion clustering data

Data compiled by: Michael M. Meot-Ner (Mautner) and Sharon G. Lias
Clustering reactions
By formula: K+ + K2O4S = (K+ • K2O4S)
Quantity | Value | Units | Method | Reference | Comment |
---|---|---|---|---|---|
ΔrH° | 160. | kJ/mol | MS | Kudin, Gusarov, et al., 1973 | gas phase; Knudsen cell |

References

Chase, 1998
Chase, M.W., Jr.,
NIST-JANAF Themochemical Tables, Fourth Edition,
J. Phys. Chem. Ref. Data, Monograph 9, 1998, 1-1951. [all data]
Blanchard, Joly, et al., 1974
Blanchard, J.M.; Joly, R.D.; Lettoffe, J.M.; Perachon, G.; Thourey, J.,
J. Chim. Phys. Phys.-Chim. Biol., 1974, 71, 472. [all data]
Kudin, Gusarov, et al., 1973
Kudin, L.S.; Gusarov, A.V.; Gorokhov, L.N.,
Mass Spectrometer Study of Equilibria Involving Ions. 1. Potassium Bromide and Sulfate,
High Temp., 1973, 11, 50. [all data]