Sulfuric acid, dimethyl ester
- Formula: C2H6O4S
- Molecular weight: 126.132
- IUPAC Standard InChIKey: VAYGXNSJCAHWJZ-UHFFFAOYSA-N
- CAS Registry Number: 77-78-1
- Chemical structure:
View 3d structure (requires JavaScript / HTML 5) - Other names: Dimethyl sulfate; DMS; Methyl Sulfate; Sulphuric acid dimethyl ester; Dimethyl sulphate; Dimethyl monosulfate; Dimethylester kyseliny sirove; Dimethylsulfaat; Dimethylsulfat; Dimetilsolfato; Dwumetylowy siarczan; DMS (Methyl sulfate); Methyl sulfate, Me2SO4; Methyle (sulfate de); Sulfate de dimethyle; Sulfate dimethylique; Rcra waste number U103; UN 1595; Dimethoxysulfone; NSC 56194

Condensed phase thermochemistry data

Data compiled by: Hussein Y. Afeefy, Joel F. Liebman, and Stephen E. Stein
Quantity | Value | Units | Method | Reference | Comment |
---|---|---|---|---|---|
ΔfH°liquid | -735.25 ± 0.92 | kJ/mol | Ccb | Mackle and Steele, 1969 |

Phase change data

Data compiled as indicated in comments:
TRC - Thermodynamics Research Center, NIST Boulder Laboratories, Chris Muzny director
ALS - Hussein Y. Afeefy, Joel F. Liebman, and Stephen E. Stein
AC - William E. Acree, Jr., James S. Chickos
Quantity | Value | Units | Method | Reference | Comment |
---|---|---|---|---|---|
Tboil | 470. | K | N/A | Mackle and Steele, 1969, 2 | Uncertainty assigned by TRC = 6. K; TRC |
Tboil | 461.7 | K | N/A | Timmermans and Mattaar, 1921 | Uncertainty assigned by TRC = 0.6 K; TRC |
Tboil | 461.95 | K | N/A | Timmermans, 1921 | Uncertainty assigned by TRC = 0.3 K; TRC |
Quantity | Value | Units | Method | Reference | Comment |
Tfus | 241.15 | K | N/A | Timmermans and Mattaar, 1921 | Uncertainty assigned by TRC = 0.5 K; TRC |
Tfus | 241.4 | K | N/A | Timmermans, 1921 | Uncertainty assigned by TRC = 0.2 K; TRC |
Quantity | Value | Units | Method | Reference | Comment |
ΔvapH° | 49. ± 2. | kJ/mol | E | Mackle and Steele, 1969 | ALS |
Enthalpy of vaporization
ΔvapH (kJ/mol) | Temperature (K) | Method | Reference | Comment |
---|---|---|---|---|
46.7 | 355. | A | Stephenson and Malanowski, 1987 | Based on data from 340. to 470. K. See also Dykyj, Svoboda, et al., 1999.; AC |

Gas phase thermochemistry data

Data compiled by: Hussein Y. Afeefy, Joel F. Liebman, and Stephen E. Stein
Quantity | Value | Units | Method | Reference | Comment |
---|---|---|---|---|---|
ΔfH°gas | -164.20 ± 0.46 | kcal/mol | Ccb | Mackle and Steele, 1969 | Reanalyzed by Cox and Pilcher, 1970, Original value = -164.1 ± 0.5 kcal/mol |

References

Mackle and Steele, 1969
Mackle, H.; Steele, W.V.,
Studies in the thermochemistry of organic sulphites and sulphates. Part 1.-Heats of combustion and formation of some dialkyl sulphites and sulphates,
Trans. Faraday Soc., 1969, 65, 2053-2059. [all data]
Mackle and Steele, 1969, 2
Mackle, H.; Steele, W.V.,
Studies in the thermochemistry of organic sulphites and sulphates: I heats of combustion and formation of some dialkyl sulphites and sulphates,
Trans. Faraday Soc., 1969, 65, 2053-9. [all data]
Timmermans and Mattaar, 1921
Timmermans, J.; Mattaar, J.F.,
Freezing points of orgainic substances VI. New experimental determinations.,
Bull. Soc. Chim. Belg., 1921, 30, 213. [all data]
Timmermans, 1921
Timmermans, J.,
The Freezing Points of Organic Substances IV. New Exp. Determinations,
Bull. Soc. Chim. Belg., 1921, 30, 62. [all data]
Stephenson and Malanowski, 1987
Stephenson, Richard M.; Malanowski, Stanislaw,
Handbook of the Thermodynamics of Organic Compounds, 1987, https://doi.org/10.1007/978-94-009-3173-2
. [all data]
Dykyj, Svoboda, et al., 1999
Dykyj, J.; Svoboda, J.; Wilhoit, R.C.; Frenkel, M.L.; Hall, K.R.,
Vapor Pressure of Chemicals: Part A. Vapor Pressure and Antoine Constants for Hydrocarbons and Sulfur, Selenium, Tellurium and Hydrogen Containing Organic Compounds, Springer, Berlin, 1999, 373. [all data]