1-Tetradecanol, TBDMS derivative
- Formula: C20H44OSi
- Molecular weight: 328.6483
- IUPAC Standard InChIKey: PRXWCONRVGAQCV-UHFFFAOYSA-N
- CAS Registry Number: 77774-34-6
- Chemical structure:
View 3d structure (requires JavaScript / HTML 5) - Other names: Silane, (1,1-dimethylethyl)dimethyl(tetradecyloxy)-; Tetradecyl tert-butyldimethylsilyl ether; 1-Tetradecanol, tert-butyldimethylsilyl ether; 1-Tetradecanol, DMTBS; 1-Tetradecanol, O-TBDMS; 1 -Tetradecanol, tBDMS; tert-Butyl(dimethyl)(tetradecyloxy)silane

Van Den Dool and Kratz RI, non-polar column, temperature ramp

Column type | Active phase | I | Reference | Comment |
---|---|---|---|---|
Capillary | DB-1 | 1987. | Peng, 1992 | 15. m/0.53 mm/1. μm, 40. C @ 4. min, 8. K/min; Tend: 250. C |

Van Den Dool and Kratz RI, non-polar column, custom temperature program

Column type | Active phase | I | Reference | Comment |
---|---|---|---|---|
Capillary | VF-5MS | 1983.3 | Zheng and White, 2008 | 30. m/0.25 mm/0.25 μm, He; Program: not specified |
Capillary | VF-5MS | 1985.0 | Tret'yakov, 2007 | 30. m/0.25 mm/0.25 μm, He; Program: Multi-step temperature program; T(initial)=60C; T(final)=270C |
Capillary | VF-5MS | 1986.3 | Tret'yakov, 2007 | 30. m/0.25 mm/0.25 μm, He; Program: Multi-step temperature program; T(initial)=60C; T(final)=270C |
Capillary | Methyl Silicone | 1987. | Peng, Yang, et al., 1991 | Program: not specified |

Van Den Dool and Kratz RI, polar column, temperature ramp

Column type | Active phase | I | Reference | Comment |
---|---|---|---|---|
Capillary | Carbowax 20M | 1969. | Peng, 1992 | 8. K/min, 200. C @ 60. min; Column length: 3.05 m; Tstart: 40. C |
Packed | Carbowax 20M | 1969. | Peng, Yang, et al., 1991 | Supelcoport, 40. C @ 4. min, 8. K/min; Column length: 3.05 m; Tend: 200. C |

References

Peng, 1992
Peng, C.T.,
A method for tentative identificatoin of unknown gas chromatographic peaks by retention index,
J. Radioanal. Nucl. Chem., 1992, 160, 2, 449-460, https://doi.org/10.1007/BF02037120
. [all data]
Zheng and White, 2008
Zheng, Y.; White, E.,
Retention Data. NIST Mass Spectrometry Data Center., NIST Mass Spectrometry Data Center, 2008. [all data]
Tret'yakov, 2007
Tret'yakov, K.V.,
Retention Data. NIST Mass Spectrometry Data Center., NIST Mass Spectrometry Data Center, 2007. [all data]
Peng, Yang, et al., 1991
Peng, C.T.; Yang, Z.C.; Maltby, D.,
Prediction of retention indexes. III. Silylated derivatives of polar compounds,
J. Chromatogr., 1991, 586, 1, 113-129, https://doi.org/10.1016/0021-9673(91)80029-G
. [all data]