Benzene, 1-chloro-4-nitro-2-(trifluoromethyl)-
- Formula: C7H3ClF3NO2
- Molecular weight: 225.552
- IUPAC Standard InChIKey: HQROXDLWVGFPDE-UHFFFAOYSA-N
- CAS Registry Number: 777-37-7
- Chemical structure:
View 3d structure (requires JavaScript / HTML 5) - Other names: Toluene, 2-chloro-α,α,α-trifluoro-5-nitro-; 2-(Trifluoromethyl)-4-nitrochlorobenzene; 3-(Trifluoromethyl)-4-chloronitrobenzene; 4-Chloro-3-(trifluoromethyl)nitrobenzene; 2-Chloro-5-nitrobenzotrifluoride; 2-Chloro-α,α,α-trifluoro-5-nitrotoluene

Phase change data

Data compiled as indicated in comments:
BS - Robert L. Brown and Stephen E. Stein
AC - William E. Acree, Jr., James S. Chickos
Quantity | Value | Units | Method | Reference | Comment |
---|---|---|---|---|---|
Tboil | 505.2 | K | N/A | Weast and Grasselli, 1989 | BS |
Reduced pressure boiling point
Tboil (K) | Pressure (bar) | Reference | Comment |
---|---|---|---|
381.2 | 0.013 | Aldrich Chemical Company Inc., 1990 | BS |
375. to 376. | 0.007 | PCR Inc., 1990 | BS |
388. to 391. | 0.024 | Frinton Laboratories Inc., 1986 | BS |
Enthalpy of vaporization
ΔvapH (kJ/mol) | Temperature (K) | Method | Reference | Comment |
---|---|---|---|---|
58.1 | 379. | A | Stephenson and Malanowski, 1987 | Based on data from 364. to 508. K. See also Kardon and Saylor, 1953, Kkykj and Repas, 1973, and Dykyj, Svoboda, et al., 1999.; AC |

References

Weast and Grasselli, 1989
CRC Handbook of Data on Organic Compounds, 2nd Editon, Weast,R.C and Grasselli, J.G., ed(s)., CRC Press, Inc., Boca Raton, FL, 1989, 1. [all data]
Aldrich Chemical Company Inc., 1990
Aldrich Chemical Company Inc.,
Catalog Handbook of Fine Chemicals, Aldrich Chemical Company, Inc., Milwaukee WI, 1990, 1. [all data]
PCR Inc., 1990
PCR Inc.,
Research Chemicals Catalog 1990-1991, PCR Inc., Gainesville, FL, 1990, 1. [all data]
Frinton Laboratories Inc., 1986
Frinton Laboratories Inc.,
Catalog Number 11, Frinton Laboratories Inc., Vineland, NJ, 1986, 99. [all data]
Stephenson and Malanowski, 1987
Stephenson, Richard M.; Malanowski, Stanislaw,
Handbook of the Thermodynamics of Organic Compounds, 1987, https://doi.org/10.1007/978-94-009-3173-2
. [all data]
Kardon and Saylor, 1953
Kardon, Samuel; Saylor, John H.,
The Vapor Pressures of Some Substituted Benzotrifluorides 1,
J. Am. Chem. Soc., 1953, 75, 8, 1997-1997, https://doi.org/10.1021/ja01104a512
. [all data]
Kkykj and Repas, 1973
Kkykj, J.; Repas, M.,
Petrochemia, 1973, 13, 179. [all data]
Dykyj, Svoboda, et al., 1999
Dykyj, J.; Svoboda, J.; Wilhoit, R.C.; Frenkel, M.L.; Hall, K.R.,
Vapor Pressure of Chemicals: Part A. Vapor Pressure and Antoine Constants for Hydrocarbons and Sulfur, Selenium, Tellurium and Hydrogen Containing Organic Compounds, Springer, Berlin, 1999, 373. [all data]