Benzene, (1-methylheptyl)-
- Formula: C14H22
- Molecular weight: 190.3245
- IUPAC Standard InChIKey: GTYIGAUPHJCMLF-UHFFFAOYSA-N
- CAS Registry Number: 777-22-0
- Chemical structure:
View 3d structure (requires JavaScript / HTML 5) - Other names: Octane, 2-phenyl-; 2-Phenyloctane; (1-Methylheptyl)benzene

Phase change data

Data compiled as indicated in comments:
TRC - Thermodynamics Research Center, NIST Boulder Laboratories, Chris Muzny director
AC - William E. Acree, Jr., James S. Chickos
Quantity | Value | Units | Method | Reference | Comment |
---|---|---|---|---|---|
Tboil | 522.65 | K | N/A | Plaskunova, Shapovalova, et al., 1986 | Uncertainty assigned by TRC = 0.5 K; TRC |
Quantity | Value | Units | Method | Reference | Comment |
Tfus | 234.3 | K | N/A | Schiessler, 1947 | Uncertainty assigned by TRC = 0.5 K; TRC |
Quantity | Value | Units | Method | Reference | Comment |
ΔvapH° | 70.0 | kJ/mol | N/A | Reid, 1972 | AC |
Enthalpy of vaporization
ΔvapH (kJ/mol) | Temperature (K) | Method | Reference | Comment |
---|---|---|---|---|
61.6 | 376. | A | Stephenson and Malanowski, 1987 | Based on data from 361. to 392. K.; AC |

Kovats' RI, non-polar column, isothermal

Column type | Active phase | Temperature (C) | I | Reference | Comment |
---|---|---|---|---|---|
Packed | Squalane | 95.4 | 1358. | Soják, Janák, et al., 1977 |

Normal alkane RI, non-polar column, temperature ramp

Column type | Active phase | I | Reference | Comment |
---|---|---|---|---|
Capillary | DB-1 | 1382. | Zenkevich, Ukolov, et al., 2011 | 30. m/0.32 mm/0.25 μm, Nitrogen, 5. K/min; Tstart: 100. C; Tend: 200. C |
Capillary | DB-1 | 1388. | Zenkevich, Ukolov, et al., 2011 | 30. m/0.32 mm/0.25 μm, Nitrogen, 5. K/min; Tstart: 100. C; Tend: 200. C |
Capillary | DB-1 | 1390. | Zenkevich, Ukolov, et al., 2011 | 30. m/0.32 mm/0.25 μm, Nitrogen, 5. K/min; Tstart: 100. C; Tend: 200. C |
Capillary | DB-1 | 1400. | Zenkevich, Ukolov, et al., 2011 | 30. m/0.32 mm/0.25 μm, Nitrogen, 5. K/min; Tstart: 100. C; Tend: 200. C |

References

Plaskunova, Shapovalova, et al., 1986
Plaskunova, S.L.; Shapovalova, I.M.; Serebryakov, B.P.,
Azerb. Khim. Zh., 1986, No. 4, 96-9. [all data]
Schiessler, 1947
Schiessler, R.W.,
, Am. Pet. Inst. Res. Proj. 42, Twelfth Meeting, 1947. [all data]
Reid, 1972
Reid, Robert C.,
Handbook on vapor pressure and heats of vaporization of hydrocarbons and related compounds, R. C. Wilhort and B. J. Zwolinski, Texas A Research Foundation. College Station, Texas(1971). 329 pages.$10.00,
AIChE J., 1972, 18, 6, 1278-1278, https://doi.org/10.1002/aic.690180637
. [all data]
Stephenson and Malanowski, 1987
Stephenson, Richard M.; Malanowski, Stanislaw,
Handbook of the Thermodynamics of Organic Compounds, 1987, https://doi.org/10.1007/978-94-009-3173-2
. [all data]