Benzene, 1,1'-(bromomethylene)bis-
- Formula: C13H11Br
- Molecular weight: 247.130
- IUPAC Standard InChIKey: OQROAIRCEOBYJA-UHFFFAOYSA-N
- CAS Registry Number: 776-74-9
- Chemical structure:
View 3d structure (requires JavaScript / HTML 5) - Other names: Methane, bromodiphenyl-; α-Bromodiphenylmethane; Benzhydryl bromide; Bromodiphenylmethane; Diphenylbromomethane; Diphenylmethyl bromide; UN 1770; NSC 39226

Phase change data

Data compiled by: Robert L. Brown and Stephen E. Stein
Quantity | Value | Units | Method | Reference | Comment |
---|---|---|---|---|---|
Tfus | 318. | K | N/A | Buckingham and Donaghy, 1982 |
Reduced pressure boiling point
Tboil (K) | Pressure (bar) | Reference |
---|---|---|
457.2 | 0.027 | Weast and Grasselli, 1989 |
425.7 | 0.003 | Weast and Grasselli, 1989 |
457. | 0.027 | Buckingham and Donaghy, 1982 |
423. to 428. | 0.003 | Buckingham and Donaghy, 1982 |

Normal alkane RI, non-polar column, custom temperature program

Column type | Active phase | I | Reference | Comment |
---|---|---|---|---|
Capillary | DB-1 | 1593. | Hathcock and Bertsch, 1993 | 100. m/0.25 mm/0.5 μm; Program: not specified |

References

Buckingham and Donaghy, 1982
Buckingham, J.; Donaghy, S.M.,
Dictionary of Organic Compounds: Fifth Edition, Chapman and Hall, New York, 1982, 1. [all data]
Weast and Grasselli, 1989
CRC Handbook of Data on Organic Compounds, 2nd Editon, Weast,R.C and Grasselli, J.G., ed(s)., CRC Press, Inc., Boca Raton, FL, 1989, 1. [all data]
Hathcock and Bertsch, 1993
Hathcock, S.; Bertsch, W.,
Analysis of volatiles associated with industrial scale processing of expanded polystyrene. Part II: Identification and quantitation,
J. Hi. Res. Chromatogr., 1993, 16, 11, 651-659, https://doi.org/10.1002/jhrc.1240161106
. [all data]