Cyclohexanone, 2-methyl-5-(1-methylethenyl)-
- Formula: C10H16O
- Molecular weight: 152.2334
- IUPAC Standard InChIKey: AZOCECCLWFDTAP-UHFFFAOYSA-N
- CAS Registry Number: 7764-50-3
- Chemical structure:
View 3d structure (requires JavaScript / HTML 5) - Stereoisomers:
- Other names: p-Menth-8-en-2-one; Dihydrocarvone; (+)-Dihydrocarvone; D-Dihydrocarvone; 2-Methyl-5-(1-methylethenyl)cyclohexanone; 5-Isopropenyl-2-methylcyclohexanone; 2-methyl-5-(1-methylvinyl)cyclohexan-1-one

Condensed phase thermochemistry data

Data compiled by: Hussein Y. Afeefy, Joel F. Liebman, and Stephen E. Stein
Quantity | Value | Units | Method | Reference | Comment |
---|---|---|---|---|---|
ΔcH°liquid | -5925.0 | kJ/mol | Ccb | Roth-Greifswald, 1911 | Heat of combustion corrected for pressure; Corresponding ΔfHºliquid = -297. kJ/mol (simple calculation by NIST; no Washburn corrections) |

References

Roth-Greifswald, 1911
Roth-Greifswald, W.A.,
XVIII. Hauptversammlung der Deutschen Bunsen-Gesellschaft fur angewandte physikalische Chemie,
Z. Electrochem., 1911, 17, 789-840. [all data]