1-Chloroprop-1-yne
- Formula: C3H3Cl
- Molecular weight: 74.509
- IUPAC Standard InChIKey: OMNGRPHPKWAMSY-UHFFFAOYSA-N
- CAS Registry Number: 7747-84-4
- Chemical structure:
View 3d structure (requires JavaScript / HTML 5) - Permanent link for this species. Use this link for bookmarking this species for future reference.

Phase change data

Data compiled by: William E. Acree, Jr., James S. Chickos
Enthalpy of vaporization
ΔvapH (kJ/mol) | Temperature (K) | Method | Reference | Comment |
---|---|---|---|---|
28.3 | 274. | A | Stephenson and Malanowski, 1987 | Based on data from 200. to 289. K. |

Gas phase ion energetics data

Data compiled as indicated in comments:
LLK - Sharon G. Lias, Rhoda D. Levin, and Sherif A. Kafafi
RDSH - Henry M. Rosenstock, Keith Draxl, Bruce W. Steiner, and John T. Herron
Ionization energy determinations
IE (eV) | Method | Reference | Comment |
---|---|---|---|
9.82 | EI | Holmes and Lossing, 1979 | LLK |
9.83 ± 0.02 | PE | Bieri, Heilbronner, et al., 1979 | LLK |
9.9 ± 0.1 | EI | Coats and Anderson, 1957 | RDSH |
Appearance energy determinations
Ion | AE (eV) | Other Products | Method | Reference | Comment |
---|---|---|---|---|---|
C3H3+ | 10.98 | Cl | EI | Holmes and Lossing, 1979 | LLK |
C3H3+ | 11.0 ± 0.2 | Cl | EI | Coats and Anderson, 1957 | RDSH |
Cl+ | 18.4 ± 0.5 | ? | EI | Coats and Anderson, 1957 | RDSH |

References

Stephenson and Malanowski, 1987
Stephenson, Richard M.; Malanowski, Stanislaw,
Handbook of the Thermodynamics of Organic Compounds, 1987, https://doi.org/10.1007/978-94-009-3173-2
. [all data]