Hexachlorocyclopentadiene
- Formula: C5Cl6
- Molecular weight: 272.772
- IUPAC Standard InChIKey: VUNCWTMEJYMOOR-UHFFFAOYSA-N
- CAS Registry Number: 77-47-4
- Chemical structure:
View 3d structure (requires JavaScript / HTML 5) - Other names: 1,3-Cyclopentadiene, 1,2,3,4,5,5-hexachloro-; C 56; Cyclopentadiene, hexachloro-; Graphlox; Hexachloro-1,3-cyclopentadiene; HRS 1655; Perchlorocyclopentadiene; 1,2,3,4,5,5-Hexachloro-1,3-cyclopentadiene; 1,3-Cyclopentadiene, hexachloro-; Hexachlorcyklopentadien; NCI-C55607; Perchloro-1,3-cyclopentadiene; HCCPD; Rcra waste number U130; UN 2646; 1,2,3,4,5,5-Hexachloro-cyclopenta-1,3-diene; NSC 9235

Gas phase thermochemistry data

Data compiled by: Hussein Y. Afeefy, Joel F. Liebman, and Stephen E. Stein
Quantity | Value | Units | Method | Reference | Comment |
---|---|---|---|---|---|
ΔfH°gas | -11.7 ± 4.4 | kJ/mol | Ccb | Lyubarskii and Smolyanets, 1977 |

Condensed phase thermochemistry data

Data compiled by: Hussein Y. Afeefy, Joel F. Liebman, and Stephen E. Stein
Quantity | Value | Units | Method | Reference | Comment |
---|---|---|---|---|---|
ΔfH°liquid | -79.2 ± 3.1 | kJ/mol | Ccb | Lyubarskii and Smolyanets, 1977 | |
Quantity | Value | Units | Method | Reference | Comment |
ΔcH°liquid | -2030. ± 3. | kJ/mol | Ccb | Lyubarskii and Smolyanets, 1977 |

Phase change data

Data compiled as indicated in comments:
BS - Robert L. Brown and Stephen E. Stein
ALS - Hussein Y. Afeefy, Joel F. Liebman, and Stephen E. Stein
AC - William E. Acree, Jr., James S. Chickos
Quantity | Value | Units | Method | Reference | Comment |
---|---|---|---|---|---|
ΔvapH° | 67. ± 1. | kJ/mol | V | Lyubarskii and Smolyanets, 1977 | ALS |
Reduced pressure boiling point
Tboil (K) | Pressure (bar) | Reference | Comment |
---|---|---|---|
512.2 | 1.00 | Weast and Grasselli, 1989 | BS |
Enthalpy of vaporization
ΔvapH (kJ/mol) | Temperature (K) | Method | Reference | Comment |
---|---|---|---|---|
53.7 | 350. | A | Stephenson and Malanowski, 1987 | Based on data from 335. to 512. K.; AC |
Enthalpy of sublimation
ΔsubH (kJ/mol) | Temperature (K) | Method | Reference | Comment |
---|---|---|---|---|
73.6 | 283. | B | Bondi, 1963 | See also Ungnade and McBee, 1958.; AC |

Reaction thermochemistry data

Data compiled by: Hussein Y. Afeefy, Joel F. Liebman, and Stephen E. Stein
Individual Reactions
By formula: C9H2Cl6O3 = C4H2O3 + C5Cl6
Quantity | Value | Units | Method | Reference | Comment |
---|---|---|---|---|---|
ΔrH° | 315. | kJ/mol | Ion | Vijayakumar and Fink, 1983 | solid phase |

Henry's Law data

Data compiled by: Rolf Sander
Henry's Law constant (water solution)
kH(T) = k°H exp(d(ln(kH))/d(1/T) ((1/T) - 1/(298.15 K)))
k°H = Henry's law constant for solubility in water at 298.15 K (mol/(kg*bar))
d(ln(kH))/d(1/T) = Temperature dependence constant (K)
k°H (mol/(kg*bar)) | d(ln(kH))/d(1/T) (K) | Method | Reference |
---|---|---|---|
0.037 | X | N/A | |
0.060 | 1500. | X | N/A |

Normal alkane RI, non-polar column, temperature ramp

Column type | Active phase | I | Reference | Comment |
---|---|---|---|---|
Capillary | HP-1 | 1314.3 | Dearth and Hites, 1991 | H2, 50. C @ 1. min, 3. K/min; Column length: 30. m; Column diameter: 0.25 mm; Tend: 320. C |
Capillary | DB-5 | 1326.8 | Dearth and Hites, 1991 | H2, 50. C @ 1. min, 3. K/min; Column length: 30. m; Column diameter: 0.25 mm; Tend: 320. C |
Capillary | SE-54 | 1328. | Harland, Cumming, et al., 1986 | He, 50. C @ 2. min, 8. K/min, 250. C @ 12. min; Column length: 25. m; Column diameter: 0.32 mm |

Normal alkane RI, non-polar column, custom temperature program

Column type | Active phase | I | Reference | Comment |
---|---|---|---|---|
Capillary | OV-1 | 1318. | Waggott and Davies, 1984 | Hydrogen; Column length: 50. m; Column diameter: 0.32 mm; Program: not specified |
Capillary | OV-1, SE-30, Methyl silicone, SP-2100, OV-101, DB-1, etc. | 1318. | Waggott and Davies, 1984 | Hydrogen; Column length: 50. m; Column diameter: 0.32 mm; Program: not specified |

Lee's RI, non-polar column, temperature ramp

Column type | Active phase | I | Reference | Comment |
---|---|---|---|---|
Capillary | DB-5 | 228.1 | Donnelly, Abdel-Hamid, et al., 1993 | 30. m/0.32 mm/0.25 μm, He, 40. C @ 3. min, 8. K/min, 285. C @ 29.5 min |

References

Lyubarskii and Smolyanets, 1977
Lyubarskii, M.V.; Smolyanets, R.I.,
Enthalpies of combustion and formation of five-membered cyclic perchlorohydrocarbons,
Vses. Konf. Kalorim. Rasshir. Tezisy Dokl. 7th, 1977, 1, 119-121. [all data]
Weast and Grasselli, 1989
CRC Handbook of Data on Organic Compounds, 2nd Editon, Weast,R.C and Grasselli, J.G., ed(s)., CRC Press, Inc., Boca Raton, FL, 1989, 1. [all data]
Stephenson and Malanowski, 1987
Stephenson, Richard M.; Malanowski, Stanislaw,
Handbook of the Thermodynamics of Organic Compounds, 1987, https://doi.org/10.1007/978-94-009-3173-2
. [all data]
Bondi, 1963
Bondi, A.,
Heat of Siblimation of Molecular Crystals: A Catalog of Molecular Structure Increments.,
J. Chem. Eng. Data, 1963, 8, 3, 371-381, https://doi.org/10.1021/je60018a027
. [all data]
Ungnade and McBee, 1958
Ungnade, H.E.; McBee, E.T.,
The Chemistry Of Perchlorocyclopentenes And Cyclopentadienes,
Chem. Rev., 1958, 58, 2, 249-320, https://doi.org/10.1021/cr50020a003
. [all data]
Vijayakumar and Fink, 1983
Vijayakumar, C.T.; Fink, J.K.,
Heat of formation of the Diels-Alder adduct of hexachlorocyclopentadiene and maleic anhydride by appearance-energy measurements,
Org. Mass Spectrom., 1983, 18, 134. [all data]
Dearth and Hites, 1991
Dearth, M.A.; Hites, R.A.,
Complete analysis of technical chlordane using negative ionization mass spectrometry,
Environ. Sci. Technol., 1991, 25, 2, 245-254, https://doi.org/10.1021/es00014a005
. [all data]
Harland, Cumming, et al., 1986
Harland, B.J.; Cumming, R.I.; Gillings, E.,
The Kovats indexes of some organic micropollutants on an SE54 capillary column,
EUR, I Org. Micropollut. Aquat. Environ., 1986, EUR 10388, 123-127. [all data]
Waggott and Davies, 1984
Waggott, A.; Davies, I.W.,
Identification of organic pollutants using linear temperature programmed retention indices (LTPRIs) - Part II, 1984, retrieved from http://dwi.defra.gov.uk/research/completed-research/reports/dwi0383.pdf. [all data]
Donnelly, Abdel-Hamid, et al., 1993
Donnelly, J.R.; Abdel-Hamid, M.S.; Jeter, J.L.; Gurka, D.F.,
Application of gas chromatographic retention properties to the identification of environmental contaminants,
J. Chromatogr., 1993, 642, 1-2, 409-415, https://doi.org/10.1016/0021-9673(93)80106-I
. [all data]