Tetra-t-amylperoxypyromellitate
- Formula: C30H46O12
- Molecular weight: 598.6790
- IUPAC Standard InChIKey: BMLIINUSXIWIJB-UHFFFAOYSA-N
- CAS Registry Number: 77473-07-5
- Chemical structure:
View 3d structure (requires JavaScript / HTML 5) - Permanent link for this species. Use this link for bookmarking this species for future reference.

Condensed phase thermochemistry data

Data compiled by: Hussein Y. Afeefy, Joel F. Liebman, and Stephen E. Stein
Quantity | Value | Units | Method | Reference | Comment |
---|---|---|---|---|---|
ΔfH°solid | -421.1 ± 1.6 | kcal/mol | Ccb | Van-Chin-Syan, Dibrivnyi, et al., 1981 | |
Quantity | Value | Units | Method | Reference | Comment |
ΔcH°solid | -3971.7 ± 1.5 | kcal/mol | Ccb | Van-Chin-Syan, Dibrivnyi, et al., 1981 | Corresponding ΔfHºsolid = -421.08 kcal/mol (simple calculation by NIST; no Washburn corrections) |

References

Van-Chin-Syan, Dibrivnyi, et al., 1981
Van-Chin-Syan, Y.Y.; Dibrivnyi, V.N.; Donchak, V.A.; Chuchmarev, S.K.,
Standard enthalpies of combustion and the formation of peroxy esters of pyromellitic acid,
Izv. Vyssh. Uchebn. Zaved., Khim. Khim. Tekhnol., 1981, 24, 1573-1574. [all data]